1,2,4,7,8-Pentachlorodibenzo-p-dioxin
- Formula: C12H3Cl5O2
- Molecular weight: 356.416
- IUPAC Standard InChIKey: QUPLGUUISJOUPJ-UHFFFAOYSA-N
- CAS Registry Number: 58802-08-7
- Chemical structure:
View 3d structure (requires JavaScript / HTML 5) - Other names: Dibenzo-p-dioxin, 1,2,4,7,8-pentachloro-; 1,2,4,7,8-Pentachlorodibenzo[b,e] [1,4]dioxin

Phase change data

Data compiled by: William E. Acree, Jr., James S. Chickos
Enthalpy of sublimation
ΔsubH (kJ/mol) | Temperature (K) | Method | Reference | Comment |
---|---|---|---|---|
125.3 ± 2.3 | 415. | ME | Li, Shibata, et al., 2004 | Based on data from 403. to 428. K. |

Van Den Dool and Kratz RI, non-polar column, custom temperature program

View large format table.

Column type Active phase I Reference Comment
CapillaryHP-52545.Korhonen and Mantykoski, 198925. m/0.20 mm/0.11 μm, He; Program: 100 0C (1 min) 20 0C/min -> 180 0C 5 0C/min -> 290 0C (until elution of the last peak)

Normal alkane RI, non-polar column, custom temperature program

View large format table.

Column type Active phase I Reference Comment
CapillaryDB-52554.Lin, Liu, et al., 2002Program: not specified
CapillaryDB-52555.Lin, Liu, et al., 2002Program: not specified

References

Li, Shibata, et al., 2004
Li, Xian-Wei; Shibata, Etsuro; Kasai, Eiki; Nakamura, Takashi,
VAPOR PRESSURES AND ENTHALPIES OF SUBLIMATION OF 17 POLYCHLORINATED DIBENZO-p-DIOXINS AND FIVE POLYCHLORINATED DIBENZOFURANS,
Environ Toxicol Chem, 2004, 23, 2, 348-808, https://doi.org/10.1897/03-193
. [all data]