2-heptanol, 5,6-dimethyl-
- Formula: C9H20O
- Molecular weight: 144.2545
- IUPAC Standard InChIKey: ONBXNGYZXZBRJA-UHFFFAOYSA-N
- CAS Registry Number: 58795-24-7
- Chemical structure:
View 3d structure (requires JavaScript / HTML 5) - Permanent link for this species. Use this link for bookmarking this species for future reference.

Phase change data

Data compiled by: Thermodynamics Research Center, NIST Boulder Laboratories, Chris Muzny director
Quantity | Value | Units | Method | Reference | Comment |
---|---|---|---|---|---|
Tboil | 465.15 | K | N/A | Wallach, 1911 | Uncertainty assigned by TRC = 4. K |

References

Wallach, 1911
Wallach, O.,
Justus Liebigs Ann. Chem., 1911, 381, 51. [all data]