4-ethyl-1,6-heptadiene
- Formula: C9H16
- Molecular weight: 124.2233
- IUPAC Standard InChIKey: JSAUYPCBLGUGAL-UHFFFAOYSA-N
- CAS Registry Number: 58794-23-3
- Chemical structure:
View 3d structure (requires JavaScript / HTML 5) - Permanent link for this species. Use this link for bookmarking this species for future reference.

Phase change data

Data compiled by: Thermodynamics Research Center, NIST Boulder Laboratories, Chris Muzny director
Quantity | Value | Units | Method | Reference | Comment |
---|---|---|---|---|---|
Tboil | 408.0 | K | N/A | Gibbons, 1941 | Uncertainty assigned by TRC = 2. K |

References

Gibbons, 1941
Gibbons, L.C.,
, Ph.D. Thesis, Ohio State Univ., Columbus, OH, 1941. [all data]