N-L-alanyl-N-L-alanyl-L-alanine

Condensed phase thermochemistry data

Data compiled by: Eugene S. Domalski and Elizabeth D. Hearing

Quantity Value Units Method Reference Comment
solid,1 bar356.1J/mol*KN/ADaurel, Delhaes, et al., 1975

References

Daurel, Delhaes, et al., 1975
Daurel, M.; Delhaes, P.; Dupart, E., Variations thermiques, entre 1 et 300K, de la chaleur specifique de la L-alanine, tri(L-alanine) et de la poly(L-alanine), Biopolymers, 1975, 14, 801-823. [all data]