4-bromo-4'-ethylbiphenyl

Phase change data

Data compiled by: Thermodynamics Research Center, NIST Boulder Laboratories, Chris Muzny director

Quantity Value Units Method Reference Comment
Tfus402.KN/AMallon and Kantor, 1989Uncertainty assigned by TRC = 2. K

In addition to the Thermodynamics Research Center (TRC) data available from this site, much more physical and chemical property data is available from the following TRC products:

References

Mallon and Kantor, 1989
Mallon, J.J.; Kantor, S.W., Thermotropic Hydrocarbon Side-Chain Liquid Crystalline Polymers. 1. Synthesis and Characterizations of Monomers and Model Compounds, Macromolecules, 1989, 22, 2070-7. [all data]