Butanoic acid, heptyl ester
- Formula: C11H22O2
- Molecular weight: 186.2912
- IUPAC Standard InChIKey: JPQHLIYIQARLQM-UHFFFAOYSA-N
- CAS Registry Number: 5870-93-9
- Chemical structure:
View 3d structure (requires JavaScript / HTML 5) - Other names: Butyric acid, heptyl ester; Heptyl butyrate; Heptyl butanoate; n-Heptyl n-butyrate; n-Heptyl butanoate

Phase change data

Data compiled as indicated in comments:
TRC - Thermodynamics Research Center, NIST Boulder Laboratories, Chris Muzny director
AC - William E. Acree, Jr., James S. Chickos
Quantity | Value | Units | Method | Reference | Comment |
---|---|---|---|---|---|
Tboil | 499.02 | K | N/A | Bilterys and Gisseleire, 1935 | Uncertainty assigned by TRC = 0.3 K; TRC |
Tboil | 498.4 | K | N/A | Gartenmeister, 1886 | Uncertainty assigned by TRC = 1.5 K; TRC |
Quantity | Value | Units | Method | Reference | Comment |
Tfus | 215.7 | K | N/A | Bilterys and Gisseleire, 1935 | Uncertainty assigned by TRC = 0.5 K; TRC |
Enthalpy of vaporization
ΔvapH (kJ/mol) | Temperature (K) | Method | Reference | Comment |
---|---|---|---|---|
58.7 | 399. | A | Stephenson and Malanowski, 1987 | Based on data from 384. to 498. K.; AC |

Kovats' RI, non-polar column, isothermal

Column type | Active phase | Temperature (C) | I | Reference | Comment |
---|---|---|---|---|---|
Capillary | SE-30 | 100. | 1287. | Haken and Korhonen, 1985 | N2; Column length: 25. m; Column diameter: 0.33 mm |
Capillary | SE-30 | 120. | 1286. | Haken and Korhonen, 1985 | N2; Column length: 25. m; Column diameter: 0.33 mm |
Capillary | SE-30 | 80. | 1279. | Haken and Korhonen, 1985 | N2; Column length: 25. m; Column diameter: 0.33 mm |
Capillary | OV-101 | 200. | 1272. | Komárek, Hornová, et al., 1983 | Column length: 15. m; Column diameter: 0.22 mm |
Packed | SE-30 | 100. | 1270. | Zarazir, Chovin, et al., 1970 | Chromosorb W; Column length: 2. m |
Packed | SE-30 | 140. | 1273. | Zarazir, Chovin, et al., 1970 | Chromosorb W; Column length: 2. m |

Kovats' RI, polar column, isothermal

Column type | Active phase | Temperature (C) | I | Reference | Comment |
---|---|---|---|---|---|
Packed | Carbowax 20M | 100. | 1526. | Zarazir, Chovin, et al., 1970 | Chromosorb W; Column length: 2. m |
Packed | Carbowax 20M | 140. | 1526. | Zarazir, Chovin, et al., 1970 | Chromosorb W; Column length: 2. m |

Van Den Dool and Kratz RI, non-polar column, temperature ramp

Column type | Active phase | I | Reference | Comment |
---|---|---|---|---|
Capillary | DB-1 | 1276. | Brat, Brillouet, et al., 2000 | 30. m/0.32 mm/0.25 μm, H2, 40. C @ 3. min, 3. K/min, 245. C @ 20. min |

Normal alkane RI, non-polar column, temperature ramp

Column type | Active phase | I | Reference | Comment |
---|---|---|---|---|
Capillary | HP-5 | 1291. | Pino, Sauri-Duch, et al., 2006 | 30. m/0.25 mm/0.25 μm, H2, 50. C @ 2. min, 4. K/min, 280. C @ 10. min |
Capillary | HP-5 | 1300. | Pino, Sauri-Duch, et al., 2006 | 30. m/0.25 mm/0.25 μm, H2, 50. C @ 2. min, 4. K/min, 280. C @ 10. min |
Capillary | OV-101 | 1274. | Tamura, Boonbumrung, et al., 2000 | Nitrogen, 40. C @ 10. min, 2. K/min; Column length: 50. m; Column diameter: 0.25 mm; Tend: 200. C |

Normal alkane RI, non-polar column, custom temperature program

Column type | Active phase | I | Reference | Comment |
---|---|---|---|---|
Capillary | HP-1 | 1276. | Yasuda and Higuchi, 2012 | Program: not specified |
Capillary | SE-30 | 1275. | Vinogradov, 2004 | Program: not specified |

Normal alkane RI, polar column, temperature ramp

Column type | Active phase | I | Reference | Comment |
---|---|---|---|---|
Capillary | DB-Wax | 1522. | Tamura, Boonbumrung, et al., 2000 | Nitrogen, 40. C @ 10. min, 2. K/min; Column length: 60. m; Column diameter: 0.25 mm; Tend: 200. C |
Capillary | DB-Wax | 1502. | Werkhoff, Güntert, et al., 1998 | 60. m/0.32 mm/0.25 μm, H2, 3. K/min; Tstart: 60. C; Tend: 220. C |

Normal alkane RI, polar column, custom temperature program

Column type | Active phase | I | Reference | Comment |
---|---|---|---|---|
Capillary | HP-Innowax | 1520. | Yasuda and Higuchi, 2012 | Program: not specified |
Capillary | Carbowax 20M | 1503. | Vinogradov, 2004 | Program: not specified |

References

Bilterys and Gisseleire, 1935
Bilterys, R.; Gisseleire, J.,
Investigations on the Congelation Temperature of Organic Compounds,
Bull. Soc. Chim. Belg., 1935, 44, 567. [all data]
Gartenmeister, 1886
Gartenmeister, R.,
Investigation of the physical characterstics of liquid compounds: vi boiling point and specific volume of normal fatty acid esters,
Justus Liebigs Ann. Chem., 1886, 233, 249-315. [all data]
Stephenson and Malanowski, 1987
Stephenson, Richard M.; Malanowski, Stanislaw,
Handbook of the Thermodynamics of Organic Compounds, 1987, https://doi.org/10.1007/978-94-009-3173-2
. [all data]
Haken and Korhonen, 1985
Haken, J.K.; Korhonen, I.O.O.,
Gas chromatography of homologous esters. XXVIII. Retention increments of aliphatic C1-C18 n-alkyl esters of butanoic acid and its monochloro derivatives on SE-30 and OV-351 capillary columns,
J. Chromatogr., 1985, 320, 2, 325-334, https://doi.org/10.1016/S0021-9673(01)90510-2
. [all data]
Komárek, Hornová, et al., 1983
Komárek, K.; Hornová, L.; Horna, A.; Churácek, J.,
Glass capillary gas chromatography of homologous series of esters. III. Separation of alkyl halogenopropionates and halogenobutyrates on OV-101,
J. Chromatogr., 1983, 262, 316-320, https://doi.org/10.1016/S0021-9673(01)88112-7
. [all data]
Zarazir, Chovin, et al., 1970
Zarazir, D.; Chovin, P.; Guiochon, G.,
Identification of hydroxylic compounds and their derivatives by gas chromatography,
Chromatographia, 1970, 3, 4, 180-195, https://doi.org/10.1007/BF02269018
. [all data]
Brat, Brillouet, et al., 2000
Brat, P.; Brillouet, J.-M.; Reynes, M.; Cogat, P.-O.; Ollé, D.,
Free volatile components of passion fruit puree obtained by flash vacuum-expansion,
J. Agric. Food Chem., 2000, 48, 12, 6210-6214, https://doi.org/10.1021/jf000645i
. [all data]
Pino, Sauri-Duch, et al., 2006
Pino, J.; Sauri-Duch, E.; Marbot, R.,
Changes in volatile compounds of Habanero chile pepper (Capsicum chinense Jack. cv. Habanero) at two ripening stages,
Food Chem., 2006, 94, 3, 394-398, https://doi.org/10.1016/j.foodchem.2004.11.040
. [all data]
Tamura, Boonbumrung, et al., 2000
Tamura, H.; Boonbumrung, S.; Yoshizawa, T.; Varanyanond, W.,
Volatile components of the essential oil in the pulp of four yellow mangoes (Mangifera indica L.) in Thailand,
Food Sci. Technol. Res., 2000, 6, 1, 68-73, https://doi.org/10.3136/fstr.6.68
. [all data]
Yasuda and Higuchi, 2012
Yasuda, T.; Higuchi, H.,
Sex pheromones of Stenotus rubrovittatus and Trigonotylus caelestialium, two mirid bugs causing pecky rice and their application to insect monitoring in Japan,
Psyshe, 2012, 2012, 1-8, https://doi.org/Article ID 435640
. [all data]
Vinogradov, 2004
Vinogradov, B.A.,
Production, composition, properties and application of essential oils, 2004, retrieved from http://viness.narod.ru. [all data]
Werkhoff, Güntert, et al., 1998
Werkhoff, P.; Güntert, M.; Krammer, G.; Sommer, H.; Kaulen, J.,
Vacuum headspace method in aroma research: flavor chemistry of yellow passion fruits,
J. Agric. Food Chem., 1998, 46, 3, 1076-1093, https://doi.org/10.1021/jf970655s
. [all data]