Benzaldehyde, 3-chloro-
- Formula: C7H5ClO
- Molecular weight: 140.567
- IUPAC Standard InChIKey: SRWILAKSARHZPR-UHFFFAOYSA-N
- CAS Registry Number: 587-04-2
- Chemical structure:

Condensed phase thermochemistry data

Data compiled by: Hussein Y. Afeefy, Joel F. Liebman, and Stephen E. Stein
Quantity | Value | Units | Method | Reference | Comment |
---|---|---|---|---|---|
ΔfH°liquid | -105. | kJ/mol | Ccb | Zavoianu, Contineanu, et al., 1987 | |
Quantity | Value | Units | Method | Reference | Comment |
ΔcH°liquid | -3365. | kJ/mol | Ccb | Zavoianu, Contineanu, et al., 1987 | |
ΔcH°liquid | -3366.9 ± 8.4 | kJ/mol | Ccb | Smith, Bjellerup, et al., 1953 | Reanalyzed by Cox and Pilcher, 1970, Original value = -3363. ± 10. kJ/mol |

Gas phase ion energetics data

Data evaluated as indicated in comments:
HL - Edward P. Hunter and Sharon G. Lias
Data compiled as indicated in comments:
B - John E. Bartmess
Quantity | Value | Units | Method | Reference | Comment |
---|---|---|---|---|---|
Proton affinity (review) | 813.0 | kJ/mol | N/A | Hunter and Lias, 1998 | HL |
Quantity | Value | Units | Method | Reference | Comment |
Gas basicity | 781.1 | kJ/mol | N/A | Hunter and Lias, 1998 | HL |
Electron affinity determinations
EA (eV) | Method | Reference | Comment |
---|---|---|---|
0.668 ± 0.087 | IMRE | Mishima, Huh, et al., 1993 | ΔGea(343 K)=-16.0 kcal/mol. Reanchored to EA(PhNO2), Kebarle and Chowdhury, 1987.; B |
0.707 ± 0.087 | IMRE | Huh, Kang, et al., 1999 | ΔG(EA) 343K; anchored to ΔG value. Including anchor ΔS, EA is ca. 0.4 kcal/mol more bound.; B |

Phase change data

Data compiled by: Robert L. Brown and Stephen E. Stein

Quantity Value Units Method Reference Comment
Tboil486.7KN/AWeast and Grasselli, 1989

Kovats' RI, non-polar column, isothermal

View large format table.

Column type Active phase Temperature (C) I Reference Comment
PackedOV-101140.1108.4Righezza, Hassani, et al., 1996N2, Chromosorb G HP; Column length: 5. m
PackedOV-101160.1118.9Hassani and Meklati, 1992N2, Chromosorb G HP; Column length: 5. m

Normal alkane RI, non-polar column, custom temperature program

View large format table.

Column type Active phase I Reference Comment
CapillaryOV-1011102.Ebrahimi and Hadjmohammadi, 2006Program: not specified

References

Zavoianu, Contineanu, et al., 1987
Zavoianu, D.; Contineanu, I.; Moga-Gheorghe, S.; Marchidan, D.I.,
Structure and reactivity of nitriles. II. Condensing reactions of methyl and dimethylphenylacetonitriles with substituted aromatic aldehydes,
Rev. Chim. (Bucharest), 1987, 38, 9-15. [all data]
Smith, Bjellerup, et al., 1953
Smith, L.; Bjellerup, L.; Krook, S.; Westermark, H.,
Heats of combustion of organic chloro compounds determined by the "quartz wool" method,
Acta Chem. Scand., 1953, 7, 65. [all data]
Cox and Pilcher, 1970
Cox, J.D.; Pilcher, G.,
Thermochemistry of Organic and Organometallic Compounds, Academic Press, New York, 1970, 1-636. [all data]
Hunter and Lias, 1998
Hunter, E.P.; Lias, S.G.,
Evaluated Gas Phase Basicities and Proton Affinities of Molecules: An Update,
J. Phys. Chem. Ref. Data, 1998, 27, 3, 413-656, https://doi.org/10.1063/1.556018
. [all data]
Mishima, Huh, et al., 1993
Mishima, M.; Huh, C.; Nakamura, H.; Fujio, M.; Tsuno, Y.,
Electron Affinities of Benzaldehydes. Substituent Effects on Stabilities of Aromatic Radical Anions.,
Tetrahed. Lett., 1993, 34, 26, 4223, https://doi.org/10.1016/S0040-4039(00)60533-6
. [all data]
Kebarle and Chowdhury, 1987
Kebarle, P.; Chowdhury, S.,
Electron affinities and electron transfer reactions,
Chem. Rev., 1987, 87, 513. [all data]
Huh, Kang, et al., 1999
Huh, C.; Kang, C.H.; Lee, H.W.; Nakamura, H.; Mishima, M.; Tsuno, Y.; Yamataka, H.,
Thermodynamic stabilities and resonance demand of aromatic radical anions in the gas phase,
Bull. Chem. Soc. Japan, 1999, 72, 5, 1083-1091, https://doi.org/10.1246/bcsj.72.1083
. [all data]