1,4-nonadiene
- Formula: C9H16
- Molecular weight: 124.2233
- IUPAC Standard InChIKey: ZHDCVEXTJJYIGZ-VQHVLOKHSA-N
- CAS Registry Number: 58688-15-6
- Chemical structure:
View 3d structure (requires JavaScript / HTML 5) - Species with the same structure:
- Stereoisomers:

Phase change data

Data compiled by: Thermodynamics Research Center, NIST Boulder Laboratories, Chris Muzny director
Quantity | Value | Units | Method | Reference | Comment |
---|---|---|---|---|---|
Tboil | 417. | K | N/A | Riobe, 1949 | Uncertainty assigned by TRC = 2. K |

References

Riobe, 1949
Riobe, O.,
Ann. Chim. (Paris), 1949, 4, 593. [all data]