Cyclohexene, 1-methyl-4-(1-methylethylidene)-
- Formula: C10H16
- Molecular weight: 136.2340
- IUPAC Standard InChIKey: MOYAFQVGZZPNRA-UHFFFAOYSA-N
- CAS Registry Number: 586-62-9
- Chemical structure:
View 3d structure (requires JavaScript / HTML 5) - Species with the same structure:
- Other names: p-Mentha-1,4(8)-diene; Terpinolene; Terpinolen; UN 2541; α- Terpinolen; α-Terpinolene; 4-Isopropylidene-1-methyl-cyclohexene; p-Menth-1,4(8)-diene; 1-Methyl-4-(propan-2-ylidene)cyclohex-1-ene; 1-Methyl-4-(1-methylethylidene)-1-cyclohexene; 69073-38-7; 1-methyl-4-(1-methylethylidene)-cyclohexene (α-terpinolene); 1-Methyl-4-(1-methylethylidene)-cyclohexene; (E)-β-Terpinolene

Phase change data

Data compiled as indicated in comments:
BS - Robert L. Brown and Stephen E. Stein
TRC - Thermodynamics Research Center, NIST Boulder Laboratories, Chris Muzny director
AC - William E. Acree, Jr., James S. Chickos
Quantity | Value | Units | Method | Reference | Comment |
---|---|---|---|---|---|
Tboil | 458. ± 3. | K | AVG | N/A | Average of 7 values; Individual data points |
Enthalpy of vaporization
ΔvapH (kJ/mol) | Temperature (K) | Method | Reference | Comment |
---|---|---|---|---|
50.5 | 320. | A | Stephenson and Malanowski, 1987 | Based on data from 305. to 458. K. See also Stull, 1947.; AC |
50.8 | 328. | N/A | Bukala, Majewski, et al., 1954 | Based on data from 313. to 363. K.; AC |
Antoine Equation Parameters
log10(P) = A − (B / (T + C))
P = vapor pressure (bar)
T = temperature (K)
View plot Requires a JavaScript / HTML 5 canvas capable browser.
Temperature (K) | A | B | C | Reference | Comment |
---|---|---|---|---|---|
313.7 to 452.1 | 2.95742 | 934.936 | -146.641 | Pickett and Peterson, 1929 | Coefficents calculated by NIST from author's data. |

Kovats' RI, non-polar column, isothermal

Column type | Active phase | Temperature (C) | I | Reference | Comment |
---|---|---|---|---|---|
Capillary | OV-1 | 100. | 1082.59 | Tarján, Bitter, et al., 2002 | 25. m/0.2 mm/0.5 μm, He |
Capillary | OV-1 | 110. | 1085.51 | Tarján, Bitter, et al., 2002 | 25. m/0.2 mm/0.5 μm, He |
Capillary | OV-1 | 120. | 1089.10 | Tarján, Bitter, et al., 2002 | 25. m/0.2 mm/0.5 μm, He |
Capillary | OV-1 | 130. | 1093.61 | Tarján, Bitter, et al., 2002 | 25. m/0.2 mm/0.5 μm, He |
Capillary | OV-1 | 140. | 1099.44 | Tarján, Bitter, et al., 2002 | 25. m/0.2 mm/0.5 μm, He |
Capillary | OV-1 | 150. | 1107.28 | Tarján, Bitter, et al., 2002 | 25. m/0.2 mm/0.5 μm, He |
Capillary | OV-1 | 80. | 1078.11 | Tarján, Bitter, et al., 2002 | 25. m/0.2 mm/0.5 μm, He |
Capillary | OV-1 | 90. | 1080.16 | Tarján, Bitter, et al., 2002 | 25. m/0.2 mm/0.5 μm, He |
Capillary | DB-1 | 150. | 1086. | Viswanathan, Maridass, et al., 2002 | 28. m/0.25 mm/0.25 μm, He |
Capillary | Apiezon L | 100. | 1101. | Morishita, Okano, et al., 1980 | Column length: 45. m; Column diameter: 0.25 mm |
Capillary | SE-30 | 100. | 1082.4 | Saeed, Redant, et al., 1979 | 80. m/0.5 mm/0.8 μm |
Capillary | SE-30 | 110. | 1086. | Saeed, Redant, et al., 1979 | 80. m/0.5 mm/0.8 μm |
Capillary | SE-30 | 130. | 1094.6 | Saeed, Redant, et al., 1979 | 80. m/0.5 mm/0.8 μm |
Capillary | SF-96 | 100. | 1082. | Kepner, Ellison, et al., 1974 | Column length: 152. m; Column diameter: 0.8 mm |
Capillary | SF-96 | 100. | 1074. | Sakai, Maarse, et al., 1967 | Column length: 152. m; Column diameter: 0.8 mm |

Kovats' RI, non-polar column, temperature ramp

Column type | Active phase | I | Reference | Comment |
---|---|---|---|---|
Capillary | HP-5MS | 1097. | Kartal N., Sokmen M., et al., 2007 | 30. m/0.25 mm/0.25 μm, He, 50. C @ 3. min, 3. K/min; Tend: 240. C |
Capillary | DB-5 | 1088. | Adams, González Elizondo, et al., 2006 | 30. m/0.26 mm/0.25 μm, He, 3. K/min; Tstart: 60. C; Tend: 246. C |
Capillary | DB-1 | 1081. | Allegrone, Belliardo, et al., 2006 | 30. m/0.25 mm/0.25 μm, He, 50. C @ 3. min, 5. K/min; Tend: 280. C |
Capillary | DB-5MS | 1083. | Angioni, Barra, et al., 2006 | 30. m/0.25 mm/0.25 μm, He, 3. K/min, 180. C @ 15. min; Tstart: 60. C |
Capillary | HP-5MS | 1093. | Hazzit, Baaliouamer, et al., 2006 | 30. m/0.25 mm/0.25 μm, He, 60. C @ 8. min, 2. K/min, 280. C @ 30. min |
Capillary | BP-1 | 1084. | Raina, Verma, et al., 2006 | 25. m/0.32 mm/0.25 μm, N2, 5. K/min, 220. C @ 13. min; Tstart: 60. C |
Capillary | DB-5 | 1089. | Adams, Morris, et al., 2005 | 30. m/0.26 mm/0.25 μm, He, 3. K/min; Tstart: 60. C; Tend: 246. C |
Capillary | DB-5 | 1088. | Adams and Nguyen, 2005 | 30. m/0.26 mm/0.25 μm, He, 3. K/min; Tstart: 60. C; Tend: 246. C |
Capillary | HP-5MS | 1088. | Asuming, Beauchamp, et al., 2005 | 30. m/0.25 mm/0.25 μm, He, 50. C @ 10. min, 3. K/min, 250. C @ 5. min |
Capillary | BP-5 | 1089. | Baranauskiene, Venskutonis, et al., 2005 | 50. m/0.32 mm/0.25 μm, He, 50. C @ 2. min, 5. K/min, 260. C @ 5. min |
Capillary | DB-5MS | 1085. | Maia, Andrade, et al., 2005 | 30. m/0.25 mm/0.25 μm, He, 3. K/min; Tstart: 60. C; Tend: 240. C |
Capillary | DB-5 | 1089. | Medina, Lucero, et al., 2005 | 30. m/0.25 mm/0.25 μm, Helium, 3. K/min; Tstart: 60. C; Tend: 255. C |
Capillary | DB-5 | 1088. | Shatar S., 2005 | 3. K/min; Tstart: 60. C; Tend: 240. C |
Capillary | DB-5MS | 1089. | Angioni, Barra, et al., 2004 | 30. m/0.25 mm/0.25 μm, He, 60. C @ 15. min, 3. K/min; Tend: 180. C |
Capillary | BPX-5 | 1091. | El-Ghorab, Mansour, et al., 2004 | 25. m/0.22 mm/0.25 μm, He, 3. K/min; Tstart: 60. C; Tend: 240. C |
Capillary | SPB-5 | 1093. | Gauvin, Lecomte, et al., 2004 | 60. m/0.32 mm/1. μm, He, 4. K/min, 200. C @ 30. min; Tstart: 60. C |
Capillary | HP-5 | 1090. | Lopes, Strobl, et al., 2004 | 30. m/0.25 mm/0.25 μm, He, 3. K/min; Tstart: 60. C; Tend: 260. C |
Capillary | DB-5 | 1098. | Merle, Morón, et al., 2004 | 25. m/0.25 mm/0.25 μm, He, 60. C @ 6. min, 5. K/min, 180. C @ 15. min |
Capillary | CP Sil 5 CB | 1070. | Ogunwande, Olawore, et al., 2004 | 25. m/0.25 mm/0.15 μm, H2, 3. K/min; Tstart: 50. C; Tend: 230. C |
Capillary | HP-5MS | 1083. | Siani, Garrido, et al., 2004 | 30. m/0.32 mm/0.25 μm, He, 70. C @ 5. min, 3. K/min; Tend: 250. C |
Capillary | DB-1 | 1079. | Velasco-Negueruela, Sanz, et al., 2004 | 50. m/0.25 mm/0.25 μm, N2, 4. K/min; Tstart: 95. C; Tend: 240. C |
Capillary | SPB-1 | 1093. | Yadav, Chauhan, et al., 2004 | 30. m/0.32 mm/0.25 μm, He, 50. C @ 2. min, 2. K/min, 250. C @ 5. min |
Capillary | DB-5 | 1089. | Amparo Blázquez, Pérez, et al., 2003 | He, 40. C @ 5. min, 3. K/min, 280. C @ 5. min; Column length: 25. m; Column diameter: 0.25 mm |
Capillary | HP-5MS | 1087. | Baranauskiene, Venskutonis, et al., 2003 | 30. m/0.25 mm/0.25 μm, He, 50. C @ 2. min, 4. K/min, 280. C @ 10. min |
Capillary | HP-5 | 1097. | Bouzouita, Kachouri, et al., 2003 | 30. m/0.25 mm/1. μm, He, 40. C @ 1. min, 5. K/min; Tend: 250. C |
Capillary | HP-5MS | 1072. | Couladis, Chinou, et al., 2003 | 30. m/0.25 mm/0.25 μm, He, 3. K/min; Tstart: 60. C; Tend: 280. C |
Capillary | DB-5 | 1089. | Lucero, Estell, et al., 2003 | 30. m/0.25 mm/0.25 μm, He, 3. K/min; Tstart: 60. C |
Capillary | CP Sil 5 CB | 1083. | Ogunwande, Olawore, et al., 2003 | 25. m/0.25 mm/0.15 μm, He, 3. K/min; Tstart: 50. C; Tend: 230. C |
Capillary | CP Sil 5 CB | 1083. | Ogunwande, Olawore, et al., 2003, 2 | 25. m/0.25 mm/0.15 μm, H2, 3. K/min; Tstart: 50. C; Tend: 230. C |
Capillary | HP-5 | 1081. | Özcan, Tzakou, et al., 2003 | 30. m/0.25 mm/0.25 μm, He, 3. K/min; Tstart: 60. C; Tend: 280. C |
Capillary | BP-1 | 1085. | Srivastava, Ahmad, et al., 2003 | 25. m/0.55 mm/0.25 μm, N2, 5. K/min, 220. C @ 15. min; Tstart: 60. C |
Capillary | DB-5 | 1099. | Buchin, Salmon, et al., 2002 | 60. m/0.32 mm/1. μm, He, 40. C @ 5. min, 3. K/min, 230. C @ 2. min |
Capillary | HP-5 | 1088. | Juliani and Simon, 2002 | 30. m/0.25 mm/0.25 μm, He, 60. C @ 1. min, 4. K/min, 200. C @ 15. min |
Capillary | CP Sil 5 CB | 1083. | Kasali, Adio, et al., 2002 | He, 3. K/min; Column length: 25. m; Column diameter: 0.25 mm; Tstart: 50. C; Tend: 230. C |
Capillary | HP-5 | 1088. | Mita, Tsitsimpikou, et al., 2002 | 30. m/0.25 mm/0.25 μm, He, 3. K/min, 240. C @ 20. min; Tstart: 60. C |
Capillary | SE-30 | 1074. | Palá-Paúl, Velasco-Negueruela, et al., 2002 | 25. m/0.22 mm/0.25 μm, He, 4. K/min; Tstart: 70. C; Tend: 220. C |
Capillary | BP-1 | 1085. | Raina, Lal, et al., 2002 | 60. m/0.32 mm/0.25 μm, N2, 5. K/min; Tstart: 60. C; Tend: 220. C |
Capillary | BP-1 | 1075. | Raina, Srivastava, et al., 2002 | 25. m/0.32 mm/0.25 μm, N2, 5. K/min, 220. C @ 15. min; Tstart: 60. C |
Capillary | BP-1 | 1084. | Raina, Srivastava, et al., 2002, 2 | 25. m/0.55 mm/0.25 μm, N2, 5. K/min, 220. C @ 15. min; Tstart: 60. C |
Capillary | Cross-Linked Methylsilicone | 1082. | Rajeswara Rao, Kaul, et al., 2002 | 50. m/0.2 mm/0.25 μm, He, 4. K/min; Tstart: 100. C; Tend: 280. C |
Capillary | HP-5MS | 1088. | Salido, Altarejos, et al., 2002 | 30. m/0.25 mm/0.25 μm, He, 3. K/min; Tstart: 50. C; Tend: 250. C |
Capillary | HP-5 | 1088. | Yáñez, Pinzón, et al., 2002 | 50. m/0.25 mm/0.25 μm, He, 50. C @ 5. min, 2.5 K/min; Tend: 250. C |
Capillary | BP-1 | 1081. | Jain, Aggarwal, et al., 2001 | 25. m/0.55 mm/0.25 μm, N2, 5. K/min, 220. C @ 15. min; Tstart: 60. C |
Capillary | BP-1 | 1075. | Jain, Srivastava, et al., 2001 | 25. m/0.55 mm/0.25 μm, N2, 5. K/min, 220. C @ 15. min; Tstart: 60. C |
Capillary | HP-5 | 1088. | Kitic, Palic, et al., 2001 | 25. m/0.32 mm/0.52 μm, H2, 4. K/min; Tstart: 40. C; Tend: 240. C |
Capillary | DB-1 | 1064. | Nagalakshmi, Thangadurai, et al., 2001 | 28. m/0.25 mm/0.25 μm, He, 50. C @ 1. min, 4.5 K/min; Tend: 270. C |
Capillary | DB-1 | 1066. | Palá-Paúl, Velasco-Negueruela, et al., 2001 | 50. m/0.25 mm/0.25 μm, N2, 4. K/min; Tstart: 80. C; Tend: 225. C |
Capillary | BP-1 | 1073. | Raina, Srivastava, et al., 2001 | 25. m/0.55 mm/0.25 μm, N2, 5. K/min, 220. C @ 15. min; Tstart: 60. C |
Capillary | DB-1 | 1077. | Senatore and Rigano, 2001 | 30. m/0.25 mm/0.25 μm, He, 40. C @ 5. min, 2. K/min, 260. C @ 20. min |
Capillary | DB-1 | 1071. | Abella, Cortella, et al., 2000 | 30. m/0.25 mm/0.25 μm, 4. K/min; Tstart: 80. C; Tend: 225. C |
Capillary | SE-54 | 1088. | Adams, 2000 | 30. m/0.26 mm/0.25 μm, He, 3. K/min; Tstart: 60. C; Tend: 246. C |
Capillary | DB-5 | 1088. | Adams, 2000, 2 | 30. m/0.26 mm/0.25 μm, He, 3. K/min; Tstart: 60. C; Tend: 240. C |
Capillary | SE-54 | 1088. | Adams, 2000, 3 | 30. m/0.26 mm/0.25 μm, 3. K/min; Tstart: 60. C; Tend: 246. C |
Capillary | DB-5 | 1088. | Adams, 2000, 4 | 30. m/0.26 mm/0.25 μm, He, 3. K/min; Tstart: 60. C; Tend: 246. C |
Capillary | SE-30 | 1076. | Kardali, Velasco-Negueruela, et al., 2000 | 25. m/0.22 mm/0.25 μm, He, 5. K/min; Tstart: 70. C; Tend: 220. C |
Capillary | HP-5 | 1087. | Ramos, Siani, et al., 2000 | 30. m/0.32 mm/0.25 μm, He, 3. K/min; Tstart: 70. C; Tend: 250. C |
Capillary | HP-5MS | 1088. | Roussis, Tsoukatou, et al., 2000 | 30. m/0.25 mm/0.25 μm, He, 3. K/min; Tstart: 60. C; Tend: 280. C |
Capillary | DB-5 | 1088. | Adams, 1999 | 30. m/0.26 mm/0.25 μm, He, 3. K/min; Tstart: 60. C; Tend: 246. C |
Capillary | SE-30 | 1081. | Jantan I. and Ahmad A.S., 1999 | He, 60. C @ 10. min, 3. K/min; Column length: 25. m; Column diameter: 0.2 mm; Tend: 180. C |
Capillary | DB-5 | 1087. | Lopes, Kato, et al., 1999 | 3. K/min; Column length: 30. m; Column diameter: 0.25 mm; Tstart: 60. C; Tend: 240. C |
Capillary | DB-5 | 1088. | Lopes, Kato, et al., 1999 | 3. K/min; Column length: 30. m; Column diameter: 0.25 mm; Tstart: 60. C; Tend: 240. C |
Capillary | HP-5 | 1087. | Sajjadi and Ghassemi, 1999 | 30. m/0.25 mm/0.25 μm, He, 4. K/min; Tstart: 60. C; Tend: 280. C |
Capillary | HP-5MS | 1092. | Siani, Ramos, et al., 1999 | 30. m/0.32 mm/0.25 μm, He, 70. C @ 5. min, 3. K/min; Tend: 250. C |
Capillary | DB-5 | 1086. | da Silva, Andrade, et al., 1999 | 30. m/0.25 mm/0.25 μm, He, 3. K/min; Tstart: 60. C; Tend: 240. C |
Capillary | BP-1 | 1082. | Vera and Chane-Ming, 1999 | 50. m/0.25 mm/0.25 μm, 2. K/min; Tstart: 60. C; Tend: 260. C |
Capillary | BP-1 | 1085. | Vera and Chane-Ming, 1999 | 50. m/0.25 mm/0.25 μm, 2. K/min; Tstart: 60. C; Tend: 260. C |
Capillary | Methyl Silicone | 1090. | Adegoke, Rao, et al., 1998 | 30. m/0.32 mm/0.25 μm, He, 60. C @ 2. min, 2. K/min, 250. C @ 5. min |
Capillary | DB-1 | 1077. | Bylaite, Venskutonis, et al., 1998 | 60. m/0.25 mm/0.25 μm, He, 50. C @ 5. min, 3. K/min, 250. C @ 10. min |
Capillary | CP Sil 5 CB | 1075. | Kaul and Vats, 1998 | 5. K/min; Column length: 25. m; Column diameter: 0.25 mm; Tstart: 60. C; Tend: 280. C |
Capillary | BP-1 | 1081. | Kulkarni, Mallavarapu, et al., 1998 | N2, 5. K/min; Column length: 25. m; Column diameter: 0.25 mm; Tstart: 60. C; Tend: 220. C |
Capillary | Methyl Silicone | 1080. | Mallavarapu, Rao, et al., 1998 | N2, 5. K/min; Column length: 25. m; Column diameter: 0.5 mm; Tstart: 60. C; Tend: 220. C |
Capillary | DB-5 | 1079. | Senatore, Urrunaga Soria, et al., 1998 | 30. m/0.25 mm/0.25 μm, He, 40. C @ 5. min, 2. K/min, 250. C @ 20. min |
Capillary | DB-5 | 1079. | Senatore, 1998 | 30. m/0.25 mm/0.25 μm, He, 40. C @ 5. min, 2. K/min, 250. C @ 20. min |
Capillary | BP-1 | 1085. | Breheret, Talou, et al., 1997 | 50. m/0.22 mm/1. μm, He, 3. K/min; Tstart: 50. C; Tend: 220. C |
Capillary | DB-5 | 1079. | Senatore, Urrunaga Soria, et al., 1997 | 30. m/0.25 mm/0.25 μm, He, 40. C @ 5. min, 2. K/min, 250. C @ 20. min |
Capillary | DB-5 | 1088. | Tellez, Estell, et al., 1997 | 30. m/0.25 mm/0.25 μm, He, 3. K/min; Tstart: 60. C; Tend: 240. C |
Capillary | SE-30 | 1081. | Jantan, Ahmad, et al., 1996 | N2, 60. C @ 10. min, 3. K/min, 180. C @ 1. min; Column length: 25. m; Column diameter: 0.2 mm |
Capillary | OV-101 | 1085. | Padrayuttawat, Tamura, et al., 1996 | 50. m/0.25 mm/0.2 μm, N2, 2. K/min, 200. C @ 60. min; Tstart: 80. C |
Capillary | SE-30 | 1081. | Jantan, Ali, et al., 1995 | N2, 60. C @ 10. min, 3. K/min, 180. C @ 1. min; Column length: 25. m; Column diameter: 0.2 mm |
Capillary | DB-5 | 1098. | Loayza, Abujder, et al., 1995 | 40. C @ 2. min, 2. K/min, 210. C @ 120. min; Column length: 30. m |
Capillary | DB-5 | 1097. | Loayza, Abujder, et al., 1995 | 40. C @ 2. min, 2. K/min, 210. C @ 120. min; Column length: 30. m |
Capillary | DB-5 | 1097. | Loayza, Abujder, et al., 1995 | 40. C @ 2. min, 2. K/min, 210. C @ 120. min; Column length: 30. m |
Capillary | OV-101 | 1077. | Menut, Molangui, et al., 1995 | N2, 5. K/min; Column length: 25. m; Column diameter: 0.25 mm; Tstart: 50. C; Tend: 200. C |
Capillary | SPB-1 | 1078. | Wong and Tie, 1993 | He, 35. C @ 5. min, 3. K/min, 200. C @ 20. min; Column length: 50. m; Column diameter: 0.20 mm |
Capillary | SE-54 | 1082. | Rembold, Wallner, et al., 1989 | 30. m/0.25 mm/0.25 μm, He, 0. C @ 12. min, 12. K/min; Tend: 250. C |
Capillary | BP-1 | 1085. | Bartley, 1988 | He, 2. K/min; Column length: 50. m; Tstart: -100. C; Tend: 200. C |
Capillary | BP-1 | 1085. | Ekundayo, Laakso, et al., 1988 | H2, 65. C @ 2. min, 5. K/min; Column length: 50. m; Column diameter: 0.33 mm; Tend: 220. C |
Capillary | DB-1 | 1110. | Burns and Tingey, 1983 | 60. m/0.25 mm/1. μm, He, 40. C @ 4. min, 12. K/min; Tend: 250. C |
Capillary | DB-1 | 1096. | Burns and Tingey, 1983 | 60. m/0.25 mm/1. μm, He, 4. K/min; Tstart: 40. C; Tend: 250. C |

Kovats' RI, non-polar column, custom temperature program

Column type | Active phase | I | Reference | Comment |
---|---|---|---|---|
Capillary | DB-5MS | 1084. | Tuberoso, Kowalczyk, et al., 2005 | 30. m/0.25 mm/0.25 μm, He; Program: 60C(5min) => 2C/min => 140C= 5C/min => 250C(5min) |
Capillary | BP-1 | 1097. | Dwivedi, Khan, et al., 2004 | 25. m/0.25 mm/0.25 μm, N2; Program: 60C => 5C/min => 220C(5min) => 3C/min => 245C(5min) |
Capillary | SPB-1 | 1074. | Riu-Aumatell, Castellari, et al., 2004 | 30. m/0.25 mm/0.25 μm; Program: not specified |
Capillary | DB-5 | 1088. | Araújo, Silveira, et al., 2003 | 30. m/0.25 mm/0.25 μm, He; Program: 35C => 4C/min => 180C => 20C/min => 280C |
Capillary | HP-5 | 1089. | Daferera, Ziogas, et al., 2003 | 30. m/0.25 mm/0.25 μm, He; Program: 40C (3min) => 3C/min => 180C => 30C/min => 270C (5min) |
Capillary | BP-1 | 1080. | Khan, Srivastava, et al., 2003 | 25. m/0.25 mm/0.25 μm, N2; Program: 60C => 5C/min => 220C (5min) => 3C/min => 245 C (5min) |
Capillary | BP-1 | 1079. | Raina, Srivastava, et al., 2003 | 25. m/0.32 mm/0.25 μm, N2; Program: 60C => 5C/min => 220C(5min) => 3C/min => 245C(5min) |
Capillary | HP-5 | 1088. | Shellie and Marriott, 2003 | 30. m/0.25 mm/0.25 μm, He; Program: not specified |
Capillary | OV-1 | 1078. | El-Shazly, Dorai, et al., 2002 | 15. m/0.317 mm/0.25 μm, He; Program: 50C(4min) => (4C/min) => 90C => (10C/min)=300C(10min) |
Capillary | BP-1 | 1080. | Khan, Srivastava, et al., 2002 | 30. m/0.32 mm/0.25 μm, N2; Program: 60 C 5 C/min -> 220 C (5 min) 3 C/min -> 245 C (5 min) |
Capillary | HP-5 | 1086. | Frizzo, Serafini, et al., 2001 | 30. m/0.32 mm/0.25 μm, H2; Program: 60 0C (8 min) 3 K/min -> 180 0C 20 K/min (20 min) |
Capillary | HP-5 | 1092. | Novak, Zitterl-Eglseer, et al., 2001 | 30. m/0.25 mm/0.25 μm, He; Program: 50 0C 5 K/min -> 140 0C 2 K/min -> 170 0C |
Capillary | AT-5 | 1087. | Khouri, Usubillaga, et al., 2000 | 60. m/0.25 mm/0.25 μm, He; Program: 60 C 4K/min -> 200 C 10 K/min -> 280 C |
Capillary | DB-5 | 1088. | Adams, 1998 | 30. m/0.26 mm/0.25 μm; Program: not specified |
Capillary | DB-5 | 1087. | Santos, Andrade, et al., 1998 | 30. m/0.25 mm/0.25 μm, He; Program: 40C => 2C/min => 60C => 4C/min => 240C |
Capillary | BP-1 | 1083. | MacLeod, MacLeod, et al., 1988 | Column length: 25. m; Column diameter: 0.2 mm; Program: not specified |
Capillary | SF-96 | 1049. | Okamoto, Ellison, et al., 1981 | Column length: 127. m; Column diameter: 0.75 mm; Program: not specified |
Capillary | SF-96 | 1081. | Malingré and Maarse, 1974 | Column length: 150. m; Column diameter: 0.75 mm; Program: not specified |
Packed | SE-30 | 1082. | Minyard, Tumlinson, et al., 1967 | He, Chromasorb W; Column length: 6.1 m; Program: 150C (10min) => 15C/min => 200C(16min) => 10C/min => 240C |

Kovats' RI, polar column, isothermal

Column type | Active phase | Temperature (C) | I | Reference | Comment |
---|---|---|---|---|---|
Capillary | PEG-20M | 100. | 1289. | Morishita, Okano, et al., 1980 | Column length: 75. m; Column diameter: 0.25 mm |
Capillary | Carbowax 20M | 100. | 1300. | Saeed, Redant, et al., 1979 | Phase thickness: 0.5 μm |
Capillary | Carbowax 20M | 70. | 1286.3 | Saeed, Redant, et al., 1979 | Phase thickness: 0.5 μm |
Capillary | Carbowax 20M | 90. | 1296.1 | Saeed, Redant, et al., 1979 | Phase thickness: 0.5 μm |
Capillary | Carbowax 20M | 70. | 1290. | Kepner, Ellison, et al., 1974 | Column length: 152. m; Column diameter: 0.8 mm |
Capillary | Carbowax 20M | 70. | 1289. | Malingré and Maarse, 1974 | Column length: 150. m; Column diameter: 0.75 mm |
Capillary | Carbowax 20M + Igepal (20:1) | 75. | 1279. | Sakai, Maarse, et al., 1967 | He, GAS PAK F; Column length: 152. m; Column diameter: 0.8 mm |
Packed | Carbowax 4000 | 130. | 1317. | Minyard, Tumlinson, et al., 1965 | N2, Gas Chrom P (60-80 mesh); Column length: 6.1 m |

Kovats' RI, polar column, temperature ramp

Column type | Active phase | I | Reference | Comment |
---|---|---|---|---|
Capillary | Stabilwax | 1300. | Hazzit, Baaliouamer, et al., 2006 | 30. m/0.32 mm/1. μm, N2, 50. C @ 3. min, 2. K/min, 220. C @ 15. min |
Capillary | HP-Wax | 1299. | Gauvin, Lecomte, et al., 2004 | 50. m/0.2 mm/0.4 μm, He, 4. K/min, 230. C @ 30. min; Tstart: 60. C |
Capillary | DB-Wax | 1274. | Lopes, Strobl, et al., 2004 | 30. m/0.32 mm/0.25 μm, He, 40. C @ 5. min, 3. K/min; Tend: 220. C |
Capillary | Supelcowax | 1287. | Riu-Aumatell, Castellari, et al., 2004 | 30. m/0.25 mm/0.25 μm, 60. C @ 5. min, 3. K/min, 240. C @ 10. min |
Capillary | Carbowax 20M | 1278. | Vera and Chane-Ming, 1999 | 50. m/0.32 mm/0.2 μm, 2. K/min; Tstart: 60. C; Tend: 260. C |
Capillary | Carbowax 20M | 1287. | Vera and Chane-Ming, 1999 | 50. m/0.32 mm/0.2 μm, 2. K/min; Tstart: 60. C; Tend: 260. C |
Capillary | Carbowax 20M | 1284. | Kulkarni, Mallavarapu, et al., 1998 | N2, 5. K/min; Column length: 25. m; Column diameter: 0.25 mm; Tstart: 60. C; Tend: 200. C |
Capillary | Carbowax 20M | 1290. | Mallavarapu, Rao, et al., 1998 | N2, 5. K/min; Column length: 25. m; Column diameter: 0.5 mm; Tstart: 60. C; Tend: 200. C |
Capillary | Supelcowax-10 | 1289. | Loayza, Abujder, et al., 1995 | 40. C @ 2. min, 2. K/min, 210. C @ 120. min; Column length: 30. m |
Capillary | Supelcowax-10 | 1280. | Loayza, Abujder, et al., 1995 | 40. C @ 2. min, 2. K/min, 210. C @ 120. min; Column length: 30. m |
Capillary | Supelcowax-10 | 1281. | Loayza, Abujder, et al., 1995 | 40. C @ 2. min, 2. K/min, 210. C @ 120. min; Column length: 30. m |
Capillary | DB-Wax | 1280. | Umano, Hagi, et al., 1994 | He, 40. C @ 2. min, 2. K/min; Column length: 60. m; Column diameter: 0.25 mm; Tend: 200. C |
Capillary | Supelcowax-10 | 1274. | Wong and Tie, 1993 | He, 35. C @ 5. min, 3. K/min, 200. C @ 20. min; Column length: 60. m; Column diameter: 0.25 mm |
Capillary | Carbowax 20M | 1305. | Randriamiharisoa and Gaydou, 1987 | He, 2. K/min; Column length: 50. m; Column diameter: 0.3 mm; Tstart: 70. C; Tend: 210. C |
Capillary | BP-20 | 1294. | Wyllie, Cook, et al., 1987 | 70. C @ 2. min, 4. K/min; Column length: 25. m; Column diameter: 0.332 mm; Tend: 200. C |
Capillary | Carbowax 20M | 1262. | Bernhard, Shibamoto, et al., 1983 | 3. K/min; Column length: 100. m; Column diameter: 0.28 mm; Tstart: 80. C; Tend: 200. C |
Capillary | Carbowax 20M | 1263. | Bernhard, Shibamoto, et al., 1983 | 3. K/min; Column length: 100. m; Column diameter: 0.28 mm; Tstart: 80. C; Tend: 200. C |

Kovats' RI, polar column, custom temperature program

Column type | Active phase | I | Reference | Comment |
---|---|---|---|---|
Capillary | HP-Innowax | 1291. | Frizzo, Serafini, et al., 2001 | 30. m/0.32 mm/0.50 μm, H2; Program: 60 0C (8 min) 3 K/min -> 180 0C 20 K/min -> 230 0C (20 min) |
Capillary | Carbowax | 1289. | Okamoto, Ellison, et al., 1981 | Column length: 127. m; Column diameter: 0.75 mm; Program: not specified |

Van Den Dool and Kratz RI, non-polar column, temperature ramp

Column type | Active phase | I | Reference | Comment |
---|---|---|---|---|
Capillary | RTX-1 | 1078. | Bendahou, Muselli, et al., 2008 | 60. m/0.22 mm/0.25 μm, He, 2. K/min, 230. C @ 30. min; Tstart: 60. C |
Capillary | Equity-5MS | 1086. | Belsito E.L., Carbone C., et al., 2007 | 30. m/0.25 mm/0.25 μm, He, 3. K/min, 250. C @ 10. min; Tstart: 50. C |
Capillary | HP-5MS | 1089. | Benkaci-Ali, Baaliouamer, et al., 2007 | 30. m/0.25 mm/0.25 μm, He, 60. C @ 8. min, 2. K/min, 250. C @ 30. min |
Capillary | BP-1 | 1080. | Castilho, Liu, et al., 2007 | 50. m/0.22 mm/0.25 μm, He, 2. K/min, 220. C @ 20. min; Tstart: 60. C |
Capillary | HP-5 | 1086. | Dehghan, Solaimanian, et al., 2007 | 25. m/0.25 mm/0.25 μm, He, 60. C @ 2. min, 4. K/min; Tend: 240. C |
Capillary | BP-1 | 1079. | Duquesnoy, Castola, et al., 2007 | 50. m/0.22 mm/0.25 μm, He, 2. K/min, 220. C @ 20. min; Tstart: 60. C |
Capillary | DB-5 | 1089. | Flamini, Cioni, et al., 2007 | 30. m/0.25 mm/0.25 μm, He, 3. K/min; Tstart: 60. C; Tend: 240. C |
Capillary | HP-5 | 1088. | Flamini, Tebano, et al., 2007 | 30. m/0.25 mm/0.25 μm, N2, 50. C @ 10. min, 5. K/min; Tend: 220. C |
Capillary | HP-5 | 1089. | Flamini, Tebano, et al., 2007, 2 | 30. m/0.25 mm/0.25 μm, N2, 60. C @ 10. min, 5. K/min; Tend: 220. C |
Capillary | DB-5 | 1088. | Hongratanaworakit and Buchbauer, 2007 | 30. m/0.25 mm/0.25 μm, He, 3. K/min; Tstart: 60. C; Tend: 246. C |
Capillary | BP-1 | 1078. | Lesueur, de Rocca Serra, et al., 2007 | 50. m/0.22 mm/0.25 μm, He, 2. K/min, 220. C @ 20. min; Tstart: 60. C |
Capillary | DB-5 | 1091. | Martins, Santos, et al., 2007 | 30. m/0.22 mm/0.25 μm, 60. C @ 2. min, 3. K/min; Tend: 240. C |
Capillary | RTX-1 | 1078. | Muselli, Rossi, et al., 2007 | 60. m/0.22 mm/0.25 μm, He, 2. K/min, 230. C @ 30. min; Tstart: 60. C |
Capillary | RTX-1 | 1079. | Paolini J., Costa J., et al., 2007 | 60. m/0.22 mm/0.25 μm, He, 2. K/min, 230. C @ 35. min; Tstart: 60. C |
Capillary | HP-101 | 1080. | Politeo, Jukic, et al., 2007 | 25. m/0.20 mm/0.20 μm, Helium, 70. C @ 2. min, 3. K/min, 200. C @ 15. min |
Capillary | HP-5 | 1087. | Quijano, Salamanca, et al., 2007 | 30. m/0.25 mm/0.25 μm, He, 50. C @ 4. min, 4. K/min, 250. C @ 10. min |
Capillary | SPB-1 | 1098. | Radulovic, Lazarevic, et al., 2007 | 30. m/0.25 mm/0.25 μm, He, 50. C @ 3. min, 5. K/min, 250. C @ 15. min |
Capillary | HP-5MS | 1085. | Radulovic, Lazarevic, et al., 2007 | 30. m/0.25 mm/0.25 μm, He, 60. C @ 5. min, 4. K/min; Tend: 280. C |
Capillary | Equity-5 | 1113. | Rocha, Coelho, et al., 2007 | 60. m/0.25 mm/1. μm, He, 40. C @ 1. min, 5. K/min, 260. C @ 15. min |
Capillary | DB-5 | 1089. | Rout, Rao, et al., 2007 | 25. m/0.25 mm/0.25 μm, He, 2. K/min, 200. C @ 60. min; Tstart: 60. C |
Capillary | DB-5 | 1090. | Sabulal, Dan, et al., 2007 | 30. m/0.25 mm/0.25 μm, He, 5. K/min; Tstart: 60. C; Tend: 260. C |
Capillary | HP-5MS | 1085. | Saroglou, Marin, et al., 2007 | 30. m/0.25 mm/0.25 μm, He, 60. C @ 5. min, 4. K/min; Tend: 280. C |
Capillary | DB-5 | 1089. | Silva, Barbosa, et al., 2007 | 30. m/0.22 mm/0.25 μm, He, 55. C @ 2. min, 3. K/min, 240. C @ 15. min |
Capillary | ZB-5 | 1087. | Simoniatto, Bonani, et al., 2007 | 30. m/0.25 mm/0.25 μm, He, 3. K/min; Tstart: 50. C; Tend: 250. C |
Capillary | DB-1 | 1084. | Sonboli, Azizian, et al., 2007 | 60. m/0.25 mm/0.25 μm, N2, 5. K/min, 250. C @ 10. min; Tstart: 60. C |
Capillary | HP-5MS | 1080. | Basta, Tzakou, et al., 2006 | 30. m/0.25 mm/0.25 μm, He, 3. K/min; Tstart: 60. C; Tend: 280. C |
Capillary | BP-1 | 1074. | Boti, Bighelli, et al., 2006 | 50. m/0.22 mm/0.25 μm, He, 2. K/min, 220. C @ 20. min; Tstart: 60. C |
Capillary | DB-5 | 1092. | Bylaite and Meyer, 2006 | 30. m/0.25 mm/1. μm, 50. C @ 1. min, 10. K/min, 290. C @ 10. min |
Capillary | RTX-1 | 1079. | Cavalli, Tomi, et al., 2006 | 60. m/0.22 mm/0.25 μm, He, 2. K/min, 230. C @ 45. min; Tstart: 60. C |
Capillary | HP-5MS | 1089. | Chorianopoulos N., Evergets E., et al., 2006 | 30. m/0.25 mm/0.25 μm, He, 3. K/min; Tstart: 60. C; Tend: 280. C |
Capillary | Mega 5MS | 1079. | Condurso, Verzera, et al., 2006 | 60. m/0.25 mm/0.25 μm, He, 3. K/min; Tstart: 60. C; Tend: 240. C |
Capillary | DB-5 | 1087. | Dob, Dahmane, et al., 2006 | 30. m/0.32 mm/0.25 μm, N2, 60. C @ 3. min, 3. K/min, 240. C @ 5. min |
Capillary | DB-5 | 1094. | Dob, Dahmane, et al., 2006, 2 | 30. m/0.25 mm/0.25 μm, N2, 60. C @ 3. min, 3. K/min, 240. C @ 3. min |
Capillary | DB-5 | 1088. | Esmaeili, Nematollahi, et al., 2006 | 50. m/0.2 mm/0.32 μm, N2, 60. C @ 3. min, 5. K/min, 220. C @ 5. min |
Capillary | HP-5 | 1089. | Flamini, Tebano, et al., 2006 | 30. m/0.25 mm/0.25 μm, N2, 60. C @ 10. min, 5. K/min; Tend: 220. C |
Capillary | BP-1 | 1080. | Gonny, Cavaleiro, et al., 2006 | 50. m/0.22 mm/0.25 μm, He, 2. K/min, 220. C @ 20. min; Tstart: 60. C |
Capillary | HP-5MS | 1087. | Kallio, Jussila, et al., 2006 | 20. m/0.25 mm/0.25 μm, 60. C @ 4. min, 5. K/min, 240. C @ 15. min |
Capillary | DB-1 | 1084. | Kuiate, Bessière, et al., 2006 | 30. m/0.25 mm/0.25 μm, N2, 4. K/min; Tstart: 50. C; Tend: 220. C |
Capillary | HP-5 | 1091. | Liu J.M., Nan P., et al., 2006 | 30. m/0.25 mm/0.25 μm, He, 60. C @ 2. min, 10. K/min, 250. C @ 10. min |
Capillary | DB-5 | 1088. | Masoudi, Esmaeili, et al., 2006 | 50. m/0.2 mm/0.32 μm, N2, 60. C @ 3. min, 5. K/min, 220. C @ 5. min |
Capillary | RTX-1 | 1077. | Paolini J., Desjobert J.M., et al., 2006 | 60. m/0.22 mm/0.25 μm, He, 2. K/min, 230. C @ 35. min; Tstart: 60. C |
Capillary | HP-5MS | 1067. | Pavlovic, Kovacevic, et al., 2006 | 30. m/0.25 mm/0.25 μm, He, 3. K/min; Tstart: 60. C; Tend: 280. C |
Capillary | DB-5 | 1083. | Pavlovic, Tzakou, et al., 2006 | 30. m/0.32 mm/0.25 μm, He, 3. K/min; Tstart: 60. C; Tend: 280. C |
Capillary | HP-5 | 1092. | Perraudin, Popovici, et al., 2006 | 60. m/0.25 mm/0.25 μm, He, 3. K/min; Tstart: 60. C; Tend: 250. C |
Capillary | SPB-1 | 1076. | Pinto, Pina-Vaz, et al., 2006 | 30. m/0.2 mm/0.2 μm, He, 3. K/min, 220. C @ 15. min; Tstart: 70. C |
Capillary | DB-1 | 1092. | Rezazadeh, Hamedani, et al., 2006 | 30. m/0.25 mm/0.25 μm, He, 4. K/min; Tstart: 60. C; Tend: 240. C |
Capillary | HP-5 | 1088. | Rezazadeh, Hamedani, et al., 2006 | 25. m/0.25 mm/0.25 μm, He, 4. K/min; Tstart: 60. C; Tend: 240. C |
Capillary | OV-1 | 1088. | Rubiolo P., Matteodo M., et al., 2006 | 25. m/0.25 mm/0.25 μm, He, 50. C @ 1. min, 3. K/min, 220. C @ 5. min |
Capillary | SPB-1 | 1077. | Salgueiro L.R., Pinto E., et al., 2006 | 30. m/0.2 mm/0.2 μm, He, 3. K/min, 220. C @ 15. min; Tstart: 70. C |
Capillary | HP-5MS | 1088. | Saroglou, Dorizas, et al., 2006 | 30. m/0.25 mm/0.25 μm, He, 60. C @ 5. min, 4. K/min; Tend: 280. C |
Capillary | DB-5 | 1089. | Su, Ho, et al., 2006 | 30. m/0.25 mm/0.25 μm, He, 50. C @ 2. min, 5. K/min; Tend: 250. C |
Capillary | DB-5 | 1089. | Su, Ho, et al., 2006, 2 | 30. m/0.25 mm/0.25 μm, He, 50. C @ 2. min, 5. K/min; Tend: 250. C |
Capillary | HP-5MS | 1080. | Vujisic L., Vuckovic I., et al., 2006 | 30. m/0.25 mm/0.25 μm, H2, 4.3 K/min; Tstart: 50. C; Tend: 285. C |
Capillary | SPB-1 | 1084. | Boskovic, Radulovic, et al., 2005 | 30. m/0.25 mm/0.25 μm, He, 50. C @ 3. min, 5. K/min, 250. C @ 15. min |
Capillary | DB-5 | 1089. | Boskovic, Radulovic, et al., 2005 | 30. m/0.2 mm/0.25 μm, He, 50. C @ 3. min, 5. K/min, 250. C @ 15. min |
Capillary | BP-1 | 1079. | Boti J.B., Koukoua G., et al., 2005 | 50. m/0.22 mm/0.25 μm, He, 2. K/min, 220. C @ 20. min; Tstart: 60. C |
Capillary | SE-54 | 1086. | Brantner, Pfeifhofer, et al., 2005 | 50. m/0.25 mm/0.27 μm, H2, 5. K/min; Tstart: 50. C; Tend: 300. C |
Capillary | HP-5 | 1089. | Celik, Gokturk, et al., 2005 | 30. m/0.25 mm/0.25 μm, N2, 60. C @ 10. min, 5. K/min; Tend: 220. C |
Capillary | DB-5 | 1084. | Choi, 2005 | 60. m/0.25 mm/0.25 μm, N2, 70. C @ 2. min, 2. K/min, 230. C @ 20. min |
Capillary | RTX-1 | 1080. | Cozzani, Muselli, et al., 2005 | 60. m/0.22 mm/0.25 μm, 2. K/min, 220. C @ 20. min; Tstart: 60. C |
Capillary | DB-1 | 1077. | Dob, Berramdane, et al., 2005 | 30. m/0.32 mm/0.25 μm, N2, 50. C @ 3. min, 2. K/min, 260. C @ 5. min |
Capillary | DB-1 | 1088. | Dob, Berramdane, et al., 2005, 2 | 30. m/0.32 mm/0.25 μm, N2, 50. C @ 3. min, 2. K/min, 260. C @ 5. min |
Capillary | MDN-5 | 1083. | Dugo, Mondello, et al., 2005 | 30. m/0.25 mm/0.25 μm, He, 3. K/min; Tstart: 50. C; Tend: 250. C |
Capillary | 5 % Phenyl methyl siloxane | 1119. | Estevez, Ventanas, et al., 2005 | 30. m/0.25 mm/1. μm, He, 40. C @ 10. min, 7. K/min, 250. C @ 5. min |
Capillary | DB-1 | 1072. | Fanciullino, Gancel, et al., 2005 | 30. m/0.25 mm/0.25 μm, He, 3. K/min, 250. C @ 20. min; Tstart: 40. C |
Capillary | BP-1 | 1078. | Ferrari, Tomi, et al., 2005 | 50. m/0.22 mm/0.25 μm, He, 2. K/min, 220. C @ 20. min; Tstart: 60. C |
Capillary | HP-5 | 1089. | Flamini, Luigi Cioni, et al., 2005 | 30. m/0.25 mm/0.25 μm, N2, 60. C @ 10. min, 5. K/min; Tend: 220. C |
Capillary | HP-5 | 1090. | Flamini, Luigi Cioni, et al., 2005, 2 | 30. m/0.25 mm/0.25 μm, N2, 60. C @ 10. min, 5. K/min; Tend: 220. C |
Capillary | DB-1 | 1075. | Gancel, Ollitrault, et al., 2005 | 30. m/0.25 mm/0.25 μm, He, 3. K/min, 250. C @ 20. min; Tstart: 40. C |
Capillary | CP Sil 5 CB | 1076. | Idzojtic, Kajba, et al., 2005 | 50. m/0.22 mm/0.13 μm, H2, 4. K/min, 300. C @ 10. min; Tstart: 40. C |
Capillary | DB-1 | 1089. | bin Jantan, Yalvema, et al., 2005 | 25. m/0.25 mm/0.25 μm, 60. C @ 10. min, 3. K/min, 180. C @ 10. min |
Capillary | HP-5 | 1088. | Javidnia, Miri, et al., 2005 | He, 3. K/min; Column length: 30. m; Column diameter: 0.25 mm; Tstart: 60. C; Tend: 260. C |
Capillary | HP-5 | 1088. | Javidnia, Miri, et al., 2005, 2 | 30. m/0.25 mm/0.25 μm, He, 3. K/min; Tstart: 60. C; Tend: 260. C |
Capillary | HP-5 | 1084. | Mahattanatawee, Goodner, et al., 2005 | 30. m/0.25 mm/0.25 μm, He, 50. C @ 5. min, 4. K/min, 250. C @ 15. min |
Capillary | HP-5MS | 1087. | Pino, Mesa, et al., 2005 | 30. m/0.25 mm/0.25 μm, He, 60. C @ 2. min, 4. K/min, 250. C @ 20. min |
Capillary | DB-5MS | 1095. | Seo and Baek, 2005 | 60. m/0.25 mm/0.25 μm, He, 2. K/min, 200. C @ 20. min; Tstart: 40. C |
Capillary | HP-5MS | 1076. | Smadja, Rondeau, et al., 2005 | 60. m/0.2 mm/0.25 μm, He, 2. K/min, 200. C @ 10. min; Tstart: 60. C |
Capillary | DB-1 | 1082. | Tchoumbougnang, Zollo, et al., 2005 | 30. m/0.25 mm/0.25 μm, N2, 5. K/min; Tstart: 50. C; Tend: 200. C |
Capillary | BP-1 | 1079. | Vellutini, Baldovini, et al., 2005 | 50. m/0.22 mm/0.25 μm, He, 2. K/min, 230. C @ 35. min; Tstart: 60. C |
Capillary | Mega 5MS | 1079. | Verzera, Trozzi, et al., 2005 | 30. m/0.25 mm/0.25 μm, He, 40. C @ 2. min, 3. K/min; Tend: 240. C |
Capillary | DB-5 | 1089. | Zhang, Xu, et al., 2005 | 30. m/0.25 mm/0.25 μm, N2, 45. C @ 10. min, 2.5 K/min, 180. C @ 20. min |
Capillary | HP-5MS | 1085. | Aligiannis, Kalpoutzakis, et al., 2004 | 30. m/0.25 mm/0.25 μm, He, 3. K/min; Tstart: 60. C; Tend: 280. C |
Capillary | SPB-1 | 1079. | Antunes, Sevinate-Pinto, et al., 2004 | 30. m/0.25 mm/0.25 μm, He, 3. K/min, 220. C @ 15. min; Tstart: 70. C |
Capillary | HP-5 | 1089. | Bertoli, Pistelli, et al., 2004 | 30. m/0.25 mm/0.25 μm, N2, 60. C @ 10. min, 5. K/min; Tend: 220. C |
Capillary | HP-5 | 1089. | Ceccarini, Macchia, et al., 2004 | 30. m/0.25 mm/0.25 μm, 60. C @ 10. min, 5. K/min; Tend: 220. C |
Capillary | HP-5MS | 1089. | Chorianopoulos, Kalpoutzakis, et al., 2004 | 30. m/0.25 mm/0.25 μm, He, 3. K/min; Tstart: 60. C; Tend: 280. C |
Capillary | RTX-5 | 1086. | Dugo, Mondello, et al., 2004 | 30. m/0.25 mm/0.25 μm, He, 45. C @ 6. min, 3. K/min, 300. C @ 10. min |
Capillary | HP-1 | 1067. | Fernández-Ocaña, Gómez-Rodríguez, et al., 2004 | 25. m/0.32 mm/0.17 μm, He, 3. K/min; Tstart: 50. C; Tend: 200. C |
Capillary | HP-5 | 1089. | Flamini, Bader, et al., 2004 | 30. m/0.25 mm/0.25 μm, He, 3. K/min; Tstart: 60. C; Tend: 240. C |
Capillary | DB-5 | 1089. | Flamini, Cioni, et al., 2004 | 30. m/0.25 mm/0.25 μm, N2, 3. K/min; Tstart: 60. C; Tend: 240. C |
Capillary | DB-5 | 1089. | Flamini, Cioni, et al., 2004 | 30. m/0.25 mm/0.25 μm, N2, 3. K/min; Tstart: 60. C; Tend: 240. C |
Capillary | ZB-5 | 1086. | Gocmen, Gurbuz, et al., 2004 | 0. m/0.32 mm/0.5 μm, 7. K/min, 265. C @ 5. min; Tstart: 40. C |
Capillary | BP-1 | 1079. | Gonny, Bradesi, et al., 2004 | 50. m/0.22 mm/0.25 μm, 2. K/min, 220. C @ 20. min; Tstart: 60. C |
Capillary | HP-5MS | 1085. | Grujic-Jovanovic, Skaltsa, et al., 2004 | 30. m/0.25 mm/0.25 μm, He, 60. C @ 5. min, 4. K/min; Tend: 280. C |
Capillary | HP-5 | 1088. | Javidnia, Miri, et al., 2004 | 30. m/0.25 mm/0.25 μm, He, 3. K/min; Tstart: 60. C; Tend: 260. C |
Capillary | HP-5 | 1088. | Javidnia, Miri, et al., 2004, 2 | He, 3. K/min; Column length: 30. m; Column diameter: 0.25 mm; Tstart: 60. C; Tend: 260. C |
Capillary | DB-5 | 1088. | Javidnia, Miri, et al., 2004, 3 | 30. m/0.25 mm/0.25 μm, He, 3. K/min; Tstart: 60. C; Tend: 260. C |
Capillary | HP-5MS | 1089. | Karioti, Hadjipavlou-Litina, et al., 2004 | 30. m/0.25 mm/0.25 μm, He, 60. C @ 5. min, 4. K/min; Tend: 280. C |
Capillary | DB-5MS | 1084. | Mardarowicz, Wianowska, et al., 2004 | 30. m/0.25 mm/0.25 μm, He, 40. C @ 2. min, 4. K/min; Tend: 280. C |
Capillary | SPB-1 | 1077. | Moldão-Martins, Beirão-da-Costa, et al., 2004 | 30. m/0.2 mm/0.2 μm, He, 3. K/min, 220. C @ 15. min; Tstart: 70. C |
Capillary | SPB-1 | 1077. | Moldão-Martins, Beirão-da-Costa, et al., 2004 | 30. m/0.2 mm/0.2 μm, He, 3. K/min, 220. C @ 15. min; Tstart: 70. C |
Capillary | HP-5MS | 1088. | Mumm, Tiemann, et al., 2004 | 30. m/0.25 mm/0.25 μm, He, 50. C @ 5. min, 5. K/min; Tend: 300. C |
Capillary | RSL-200 | 1087. | Ngassoum, Ousmaila, et al., 2004 | 30. m/0.32 mm/0.25 μm, H2, 40. C @ 5. min, 6. K/min, 280. C @ 5. min |
Capillary | Methyl Silicone | 1088. | Özcan and Chalchat, 2004 | He, 3. K/min; Column length: 50. m; Column diameter: 0.25 mm; Tstart: 50. C; Tend: 240. C |
Capillary | SPB-5 | 1088. | Píno, Marbot, et al., 2004 | 30. m/0.25 mm/0.25 μm, He, 60. C @ 2. min, 4. K/min, 250. C @ 20. min |
Capillary | SPB-5 | 1089. | Pino, Marbot, et al., 2004 | 30. m/0.25 mm/0.25 μm, He, 60. C @ 2. min, 4. K/min, 250. C @ 20. min |
Capillary | SPB-5 | 1086. | Pino, Marbot, et al., 2004, 2 | 30. m/0.25 mm/0.25 μm, He, 60. C @ 2. min, 4. K/min, 250. C @ 20. min |
Capillary | HP-5MS | 1088. | Salido, Valenzuela, et al., 2004 | 30. m/0.25 mm/0.25 μm, He, 3. K/min; Tstart: 50. C; Tend: 250. C |
Capillary | HP-5 | 1083. | Sartoratto, Machado, et al., 2004 | 25. m/0.2 mm/0.33 μm, He, 3. K/min, 240. C @ 7. min; Tstart: 60. C |
Capillary | HP-5 | 1088. | Stashenko, Jaramillo, et al., 2004 | 50. m/0.2 mm/0.2 μm, He, 40. C @ 15. min, 3. K/min, 250. C @ 40. min |
Capillary | BP-1 | 1078. | Tam, Thuam, et al., 2004 | 50. m/0.22 mm/0.25 μm, He, 2. K/min, 220. C @ 20. min; Tstart: 60. C |
Capillary | HP-5MS | 1071. | Tzakou, Vagias, et al., 2004 | 30. m/0.25 mm/0.25 μm, He, 3. K/min; Tstart: 60. C; Tend: 280. C |
Capillary | Optima 5 | 1089. | Vérité, Nacer, et al., 2004 | 25. m/0.25 mm/0.25 μm, He, 3. K/min, 280. C @ 20. min; Tstart: 60. C |
Capillary | SBP-5 | 1104. | Yoo, Kim, et al., 2004 | 60. m/0.25 mm/0.25 μm, Helium, 50. C @ 3. min, 5. K/min, 240. C @ 10. min |
Capillary | DB-5MS | 1087. | Yu, Kim, et al., 2004 | 30. m/0.25 mm/0.25 μm, He, 40. C @ 5. min, 4. K/min, 200. C @ 20. min |
Capillary | DB-5MS | 1090. | Yu, Kim, et al., 2004 | 30. m/0.25 mm/0.25 μm, He, 40. C @ 5. min, 4. K/min, 200. C @ 20. min |
Capillary | DB-5MS | 1090. | Yu, Kim, et al., 2004, 2 | 30. m/0.25 mm/0.25 μm, He, 40. C @ 5. min, 4. K/min, 200. C @ 20. min |
Capillary | DB-5MS | 1089. | Yu, Kim, et al., 2004, 2 | 30. m/0.25 mm/0.25 μm, He, 40. C @ 5. min, 4. K/min, 200. C @ 20. min |
Capillary | DB-5 | 1091. | bin Ahmad and bin Jantan, 2003 | 25. m/0.25 mm/0.25 μm, N2, 75. C @ 10. min, 3. K/min, 210. C @ 1. min |
Capillary | DB-5 | 1089. | Bader, Caponi, et al., 2003 | 30. m/0.25 mm/0.25 μm, He, 3. K/min, 240. C @ 30. min; Tstart: 60. C |
Capillary | DB-5 | 1089. | Bader, Caponi, et al., 2003, 2 | 30. m/0.25 mm/0.25 μm, N2, 60. C @ 10. min, 5. K/min; Tend: 220. C |
Capillary | DB-5 | 1090. | Bader, Flamini, et al., 2003 | 30. m/0.25 mm/0.25 μm, He, 3. K/min; Tstart: 60. C; Tend: 240. C |
Capillary | BP-1 | 1080. | Bianchini, Tomi, et al., 2003 | 50. m/0.22 mm/0.25 μm, He, 2. K/min, 230. C @ 35. min; Tstart: 60. C |
Capillary | BP-1 | 1080. | Bianchini, Tomi, et al., 2003 | 50. m/0.22 mm/0.25 μm, He, 2. K/min, 230. C @ 35. min; Tstart: 60. C |
Capillary | OV-1 | 1076. | Bicchi, Rubiolo, et al., 2003 | 25. m/0.25 mm/0.3 μm, H2, 50. C @ 1. min, 3. K/min, 200. C @ 20. min |
Capillary | DB-1 | 1067. | Brat, Rega, et al., 2003 | 30. m/0.25 mm/0.25 μm, He, 3. K/min, 250. C @ 20. min; Tstart: 40. C |
Capillary | SPB-1 | 1077. | Cavaleiro, Salgueiro, et al., 2003 | 30. m/0.2 mm/0.2 μm, He, 3. K/min, 220. C @ 15. min; Tstart: 70. C |
Capillary | RTX-1 | 1079. | Cavalli, Tomi, et al., 2003 | 60. m/0.22 mm/0.25 μm, He, 2. K/min, 230. C @ 45. min; Tstart: 60. C |
Capillary | Ultra-2 | 1087. | Ceva-Antunes, Bizzo, et al., 2003 | 25. m/0.25 mm/0.33 μm, H2, 40. C @ 2. min, 3. K/min, 280. C @ 10. min |
Capillary | DB-5 | 1084. | Choi, 2003 | 30. m/0.25 mm/0.25 μm, N2, 70. C @ 2. min, 2. K/min, 230. C @ 20. min |
Capillary | HP-5 | 1089. | Emilio Tomei, Manganelli, et al., 2003 | 30. m/0.25 mm/0.25 μm, N2, 60. C @ 10. min, 5. K/min; Tend: 220. C |
Capillary | DB-1 | 1071. | de Feo, Bruno, et al., 2003 | 30. m/0.25 mm/0.25 μm, He, 40. C @ 5. min, 2. K/min, 250. C @ 20. min |
Capillary | DB-1 | 1065. | de Feo, Urrunaga Soria, et al., 2003 | 30. m/0.25 mm/0.25 μm, He, 40. C @ 5. min, 2. K/min; Tend: 250. C |
Capillary | DB-5 | 1089. | Flamini, Luigi Cioni, et al., 2003 | 30. m/0.25 mm/0.25 μm, He, 3. K/min; Tstart: 60. C; Tend: 240. C |
Capillary | HP-5 | 1089. | Flamini, Luigi Cioni, et al., 2003, 2 | 30. m/0.25 mm/0.25 μm, N2, 60. C @ 10. min, 5. K/min; Tend: 220. C |
Capillary | HP-5 | 1089. | Flamini, Luigi Cioni, et al., 2003, 3 | 30. m/0.25 mm/0.25 μm, N2, 60. C @ 10. min, 5. K/min; Tend: 220. C |
Capillary | DB-1 | 1075. | Gancel, Ollitrault, et al., 2003 | 30. m/0.25 mm/0.25 μm, He, 3. K/min, 250. C @ 20. min; Tstart: 40. C |
Capillary | DB-5 | 1096. | Högnadóttir and Rouseff, 2003 | 30. m/0.32 mm/0.5 μm, 7. K/min, 265. C @ 5. min; Tstart: 40. C |
Capillary | HP-5 | 1087. | Isidorov, Vinogorova, et al., 2003 | 25. C @ 5. min, 3. K/min; Column length: 30. m; Column diameter: 0.25 mm; Tend: 150. C |
Capillary | DB-5 | 1089. | Jantan, Ling, et al., 2003 | 30. m/0.25 mm/0.25 μm, He, 75. C @ 10. min, 3. K/min, 230. C @ 20. min |
Capillary | DB-5 | 1089. | bin Jantan, Yassin, et al., 2003 | 30. m/0.25 mm/0.25 μm, N2, 75. C @ 10. min, 3. K/min; Tend: 230. C |
Capillary | DB-5 | 1090. | Javidnia, Miri, et al., 2003 | He, 4. K/min; Column length: 25. m; Column diameter: 0.25 mm; Tstart: 60. C; Tend: 260. C |
Capillary | HP-5 | 1088. | Karioti, Skaltsa, et al., 2003 | 30. m/0.25 mm/0.25 μm, He, 60. C @ 5. min, 4. K/min; Tend: 280. C |
Capillary | HP-5 | 1089. | Macchioni, Cioni, et al., 2003 | 30. m/0.25 mm/0.25 μm, He, 3. K/min; Tstart: 60. C; Tend: 240. C |
Capillary | HP-5 | 1088. | Ngassapa, Runyoro, et al., 2003 | 30. m/0.25 mm/0.25 μm, He, 3. K/min; Tstart: 60. C; Tend: 280. C |
Capillary | SPB-5 | 1087. | Pino, Marbot, et al., 2003 | 30. m/0.25 mm/0.25 μm, He, 60. C @ 2. min, 4. K/min, 250. C @ 20. min |
Capillary | HP-5MS | 1088. | Salido, Altarejos, et al., 2003 | 30. m/0.25 mm/0.25 μm, He, 3. K/min; Tstart: 50. C; Tend: 250. C |
Capillary | DB-1 | 1070. | Senatore, Lentini, et al., 2003 | 30. m/0.25 mm/0.25 μm, He, 40. C @ 5. min, 2. K/min, 270. C @ 20. min |
Capillary | MS5 | 1088. | Shao, Marriott, et al., 2003 | 25. m/0.25 mm/0.25 μm, 3. K/min; Tstart: 40. C; Tend: 180. C |
Capillary | RTX-5 | 1089. | Shellie, Marriott, et al., 2003 | 30. m/0.25 mm/0.25 μm, He, 45. C @ 6. min, 3. K/min; Tend: 250. C |
Capillary | HP-5 | 1087. | Shellie and Marriott, 2003 | 30. m/0.25 mm/0.25 μm, He, 3. K/min; Tstart: 40. C; Tend: 240. C |
Capillary | HP-5 | 1085. | Skaltsa, Demetzos, et al., 2003 | 30. m/0.25 mm/0.25 μm, He, 60. C @ 5. min, 4. K/min; Tend: 280. C |
Capillary | DB-1 | 1077.8 | Sun and Stremple, 2003 | 30. m/0.25 mm/0.25 μm, He, 3. K/min; Tstart: 40. C; Tend: 325. C |
Capillary | HP-5 | 1089. | Tsiri, Kretsi, et al., 2003 | 30. m/0.25 mm/0.25 μm, He, 3. K/min; Tstart: 60. C; Tend: 280. C |
Capillary | HP-5 | 1089. | Tsiri, Kretsi, et al., 2003 | 30. m/0.25 mm/0.25 μm, He, 3. K/min; Tstart: 60. C; Tend: 280. C |
Capillary | Mega 5MS | 1079. | Verzera, Trozzi, et al., 2003 | 30. m/0.25 mm/0.25 μm, He, 40. C @ 2. min, 3. K/min; Tend: 240. C |
Capillary | SPB-1 | 1077. | Cavaleiro, Salgueiro, et al., 2002 | 30. m/0.20 mm/0.20 μm, He, 3. K/min, 220. C @ 15. min; Tstart: 70. C |
Capillary | DB-5 | 1084. | Choi, Kim. M.-S.L., et al., 2002 | 30. m/0.25 mm/0.25 μm, He, 70. C @ 2. min, 4. K/min, 230. C @ 20. min |
Capillary | HP-5MS | 1071. | Couladis, Chinou, et al., 2002 | 30. m/0.25 mm/0.25 μm, He, 3. K/min; Tstart: 60. C; Tend: 300. C |
Capillary | CP Sil 8 CB | 1094. | Duckham, Dodson, et al., 2002 | 60. m/0.25 mm/0.25 μm, He, 40. C @ 8. min, 4. K/min, 250. C @ 10. min |
Capillary | SE-52 | 1084. | Duru, Cakir, et al., 2002 | 25. m/0.32 mm/0.15 μm, N2, 45. C @ 5. min, 3. K/min, 200. C @ 20. min |
Capillary | DB-5 | 1088. | Economakis, Skaltsa, et al., 2002 | 30. m/0.25 mm/0.25 μm, 50. C @ 5. min, 3. K/min; Tend: 280. C |
Capillary | DB-5 | 1089. | Flamini, Cioni, et al., 2002 | 30. m/0.25 mm/0.25 μm, He, 3. K/min; Tstart: 60. C; Tend: 240. C |
Capillary | HP-5 | 1089. | Flamini, Cioni, et al., 2002, 2 | 30. m/0.25 mm/0.25 μm, N2, 60. C @ 10. min, 5. K/min; Tend: 220. C |
Capillary | HP-5 | 1088. | Fokialakis, Magiatis, et al., 2002 | 30. m/0.25 mm/0.25 μm, 60. C @ 5. min, 3. K/min; Tend: 280. C |
Capillary | RTX-5 MS | 1089. | Hudaib, Speroni, et al., 2002 | 30. m/0.25 mm/0.25 μm, He, 45. C @ 10. min, 2.5 K/min; Tend: 180. C |
Capillary | DB-1 | 1081. | bin Jantan and bin Ahmad, 2002 | N2, 60. C @ 10. min, 3. K/min, 180. C @ 10. min; Column length: 25. m; Column diameter: 0.25 mm |
Capillary | SE-30 | 1081. | bin Jantan, Ayop, et al., 2002 | 25. m/0.25 mm/0.25 μm, N2, 60. C @ 10. min, 3. K/min, 180. C @ 10. min |
Capillary | BP-1 | 1078. | Lota, de Rocca Serra, et al., 2002 | 50. m/0.22 mm/0.25 μm, He, 2. K/min, 220. C @ 20. min; Tstart: 60. C |
Capillary | DB-5 | 1088. | Miri, Ramezani, et al., 2002 | He, 4. K/min; Column length: 25. m; Column diameter: 0.25 mm; Tstart: 70. C; Tend: 260. C |
Capillary | RTX-5 | 1088. | Mondello, Zappia, et al., 2002 | 30. m/0.25 mm/0.25 μm, He, 45. C @ 6. min, 3. K/min, 300. C @ 10. min |
Capillary | CP Sil 5 CB | 1072. | Pino, Marbot, et al., 2002 | 25. m/0.25 mm/0.25 μm, N2, 60. C @ 6. min, 4. K/min; Tend: 280. C |
Capillary | SPB-5 | 1088. | Pino, Marbot, et al., 2002, 2 | 30. m/0.25 mm/0.25 μm, He, 60. C @ 2. min, 4. K/min, 250. C @ 20. min |
Capillary | CP Sil 5 CB | 1076. | Pino, Marbot, et al., 2002, 3 | 30. m/0.25 mm/0.25 μm, H2, 60. C @ 10. min, 2. K/min, 280. C @ 40. min |
Capillary | CP Sil 5 CB | 1076. | Pino, Marbot, et al., 2002, 4 | 50. m/0.32 mm/0.4 μm, He, 60. C @ 10. min, 3. K/min, 280. C @ 60. min |
Capillary | DB-1 | 1079. | Pintore, Usai, et al., 2002 | 50. m/0.22 mm/0.25 μm, He, 2. K/min, 220. C @ 20. min; Tstart: 60. C |
Capillary | HP-5 | 1063. | Pitarokili, Couladis, et al., 2002 | 30. m/0.25 mm/0.25 μm, He, 3. K/min; Tstart: 60. C; Tend: 280. C |
Capillary | RTX-5 | 1088. | Shellie, Mondello, et al., 2002 | 30. m/0.25 mm/0.25 μm, He, 45. C @ 6. min, 3. K/min; Tend: 250. C |
Capillary | RTX-5 | 1088. | Shellie, Mondello, et al., 2002 | 30. m/0.25 mm/0.25 μm, He, 45. C @ 6. min, 3. K/min; Tend: 250. C |
Capillary | HP-5 | 1089. | Aligiannis, Kalpoutzakis, et al., 2001 | 30. m/0.25 mm/0.25 μm, He, 60. C @ 5. min, 3. K/min; Tend: 280. C |
Capillary | HP-5 | 1085. | Aligiannis, Kalpoutzakis, et al., 2001, 2 | 30. m/0.25 mm/0.25 μm, He, 60. C @ 5. min, 3. K/min; Tend: 280. C |
Capillary | BP-1 | 1080. | Bianchini, Tomi, et al., 2001 | 50. m/0.22 mm/0.25 μm, He, 2. K/min, 230. C @ 35. min; Tstart: 60. C |
Capillary | HP-5 | 1087. | Couladis, Baziou, et al., 2001 | 30. m/0.25 mm/0.25 μm, He, 3. K/min, 260. C @ 10. min; Tstart: 60. C |
Capillary | HP-5 | 1088. | Couladis, Tsortanidou, et al., 2001 | 30. m/0.25 mm/0.25 μm, He, 3. K/min; Tstart: 60. C; Tend: 380. C |
Capillary | HP-5MS | 1088. | Giamakis, Kretsi, et al., 2001 | 30. m/0.25 mm/0.25 μm, He, 60. C @ 5. min, 3. K/min; Tend: 280. C |
Capillary | RTX-5 MS | 1089. | Hudaib, Grazia Bellardi, et al., 2001 | 30. m/0.25 mm/0.25 μm, He, 70. C @ 10. min, 4. K/min, 210. C @ 10. min |
Capillary | SE-30 | 1089. | bin Jantan, Basni, et al., 2001 | N2, 60. C @ 10. min, 3. K/min, 180. C @ 1. min; Column length: 25. m; Column diameter: 0.20 mm |
Capillary | BP-1 | 1078. | Lota, Serra, et al., 2001 | 50. m/0.22 mm/0.25 μm, He, 2. K/min; Tstart: 60. C; Tend: 220. C |
Capillary | BP-1 | 1078. | Lota, Serra, et al., 2001 | 50. m/0.22 mm/0.25 μm, He, 2. K/min; Tstart: 60. C; Tend: 220. C |
Capillary | CP Sil 5 CB | 1076. | Pino and Marbot, 2001 | 50. m/0.32 mm/0.4 μm, He, 60. C @ 10. min, 3. K/min, 280. C @ 60. min |
Capillary | CP Sil 5 CB | 1076. | Pino, Marbot, et al., 2001 | 50. m/0.32 mm/0.4 μm, He, 60. C @ 10. min, 3. K/min, 280. C @ 60. min |
Capillary | BP-1 | 1079. | Rezzi, Bighelli, et al., 2001 | 50. m/0.22 mm/0.25 μm, He, 2. K/min, 220. C @ 20. min; Tstart: 60. C |
Capillary | BP-1 | 1078. | Rezzi, Cavaleiro, et al., 2001 | 50. m/0.22 mm/0.25 μm, 2. K/min, 220. C @ 20. min; Tstart: 60. C |
Capillary | HP-5MS | 1088. | Salido, Altarejos, et al., 2001 | 30. m/0.25 mm/0.25 μm, He, 3. K/min; Tstart: 50. C; Tend: 250. C |
Capillary | HP-5MS | 1085. | Skaltsa, Mavrommati, et al., 2001 | 30. m/0.25 mm/0.25 μm, He, 60. C @ 5. min, 4. K/min; Tend: 280. C |
Capillary | BPX-5 | 1095. | Zabaras and Wyllie, 2001 | 50. m/0.22 mm/0.25 μm, H2, 60. C @ 5. min, 4. K/min, 180. C @ 5. min |
Capillary | DB-5 | 1076. | Bartley and Jacobs, 2000 | 60. m/0.25 mm/0.25 μm, He, 40. C @ 2. min, 4. K/min, 290. C @ 5. min |
Capillary | DB-1 | 1074. | Brat, Brillouet, et al., 2000 | 30. m/0.32 mm/0.25 μm, H2, 40. C @ 3. min, 3. K/min, 245. C @ 20. min |
Capillary | CP Sil 8 CB | 1088. | Chevance, Farmer, et al., 2000 | 60. C @ 5. min, 4. K/min, 220. C @ 30. min |
Capillary | HP-5 | 1083. | Kim, Thuy, et al., 2000 | 30. m/0.25 mm/0.25 μm, He, 40. C @ 5. min, 2. K/min, 200. C @ 20. min |
Capillary | BP-1 | 1078. | Lota, de Rocca Serra, et al., 2000 | 50. m/0.22 mm/0.25 μm, He, 2. K/min, 230. C @ 35. min; Tstart: 60. C |
Capillary | BP-1 | 1078. | Lota, de Rocca Serra, et al., 2000 | 50. m/0.22 mm/0.25 μm, He, 2. K/min, 230. C @ 35. min; Tstart: 60. C |
Capillary | HP-101 | 1079. | Milos and Radonic, 2000 | 25. m/0.2 mm/0.2 μm, He, 70. C @ 2. min, 3. K/min, 200. C @ 10. min |
Capillary | RTX-5 | 1093. | Mondello, Zappia, et al., 2000 | 10. m/0.1 mm/0.1 μm, He, 12.3 K/min; Tstart: 50. C; Tend: 350. C |
Capillary | SE-30 | 1087. | Paramonov, Khalilova, et al., 2000 | 6. K/min; Column length: 50. m; Column diameter: 0.2 mm; Tstart: 50. C; Tend: 250. C |
Capillary | CP Sil 5 CB | 1081. | Pfeifhofer, 2000 | 50. m/0.22 mm/0.13 μm, H2, 4. K/min, 300. C @ 10. min; Tstart: 40. C |
Capillary | HP-5 | 1069. | Song, Sawamura, et al., 2000 | 30. m/0.25 mm/0.25 μm, He, 2. K/min; Tstart: 70. C; Tend: 230. C |
Capillary | DB-5 | 1069. | Song, Sawamura, et al., 2000, 2 | 30. m/0.25 mm/0.25 μm, N2, 2. K/min; Tstart: 70. C; Tend: 230. C |
Capillary | Mega 5MS | 1079. | Verzera, la Rosa, et al., 2000 | 30. m/0.25 mm/0.25 μm, He, 40. C @ 2. min, 3. K/min; Tend: 240. C |
Capillary | Mega 5MS | 1079. | Verzera, Trozzi, et al., 2000 | 30. m/0.25 mm/0.25 μm, He, 40. C @ 2. min, 3. K/min; Tend: 240. C |
Capillary | CBP-1 | 1082. | Zunino, Lopez, et al., 2000 | He, 4. K/min; Column length: 30. m; Column diameter: 0.25 mm; Tstart: 60. C; Tend: 240. C |
Capillary | CP Sil 8 CB | 1088. | Chevance and Farmer, 1999 | 60. C @ 5. min, 4. K/min, 220. C @ 30. min; Column length: 50. m; Column diameter: 0.32 mm |
Capillary | DB-1 | 1085.3 | Helmig, Klinger, et al., 1999 | 60. m/0.32 mm/1. μm, -50. C @ 2. min, 6. K/min; Tend: 175. C |
Capillary | BP-1 | 1078. | Lota, Serra, et al., 1999 | 50. m/0.22 mm/0.25 μm, He, 2. K/min, 230. C @ 35. min; Tstart: 60. C |
Capillary | BP-1 | 1078. | Lota, Serra, et al., 1999 | 50. m/0.22 mm/0.25 μm, He, 2. K/min, 230. C @ 35. min; Tstart: 60. C |
Capillary | OV-101 | 1083. | Menut, Bessiere, et al., 1999 | N2, 5. K/min; Column length: 25. m; Column diameter: 0.25 mm; Tstart: 50. C; Tend: 200. C |
Capillary | HP-1 | 1077. | Stashenko, Cervantes, et al., 1999 | 60. m/0.25 mm/0.25 μm, He, 50. C @ 5. min, 2.5 K/min; Tend: 250. C |
Capillary | Methyl Silicone | 1081. | Sumathykutty, Rao, et al., 1999 | 50. m/0.25 mm/0.17 μm, N2, 2. K/min; Tstart: 80. C; Tend: 200. C |
Capillary | CP Sil 5 CB | 1082. | Weyerstahl, Marschall, et al., 1999 | He, 5. K/min; Column length: 25. m; Column diameter: 0.25 mm; Tstart: 60. C; Tend: 260. C |
Capillary | OV-1 | 1074. | Bicchi, Rubiolo, et al., 1998 | 25. m/0.25 mm/0.3 μm, 50. C @ 1. min, 3. K/min, 200. C @ 20. min |
Capillary | DB-5 | 1088. | Isidorov, Zenkevich, et al., 1998 | 30. m/0.25 mm/0.25 μm, 3. K/min; Tstart: 50. C; Tend: 250. C |
Capillary | SPB-5 | 1097. | Verdier-Metz., Coulon, et al., 1998 | 60. m/0.32 mm/1. μm, He, 40. C @ 5. min, 3. K/min, 200. C @ 2. min |
Capillary | BP-1 | 1082. | Tam, An, et al., 1998 | 50. m/0.22 mm/0.25 μm, He, 2. K/min, 220. C @ 20. min; Tstart: 60. C |
Capillary | BP-1 | 1080. | Mariotti, Costa, et al., 1997 | 50. m/0.22 mm/0.25 μm, He, 2. K/min, 230. C @ 35. min; Tstart: 60. C |
Capillary | BP-1 | 1075. | Mariotti, Tomi, et al., 1997 | 50. m/0.22 mm/0.25 μm, He, 2. K/min, 230. C @ 35. min; Tstart: 60. C |
Capillary | DB-1 | 1083. | Warthen, Lee, et al., 1997 | 25. m/0.2 mm/0.11 μm, He, 5. K/min; Tstart: 50. C; Tend: 250. C |
Capillary | DB-1 | 1085. | Warthen, Lee, et al., 1997 | 25. m/0.2 mm/0.11 μm, He, 5. K/min; Tstart: 50. C; Tend: 250. C |
Capillary | Methyl Silicone | 1092. | Píry, Príbela, et al., 1995 | 25. m/0.2 mm/0.3 μm, He, 2. K/min; Tstart: 40. C; Tend: 200. C |
Capillary | DB-1 | 1074. | Combariza, Tirado, et al., 1994 | 60. m/0.25 mm/0.25 μm, He, 70. C @ 5. min, 2.5 K/min, 250. C @ 15. min |
Capillary | HP-101 | 1089. | Chung, Eiserich, et al., 1993 | N2, 3. K/min; Column length: 50. m; Column diameter: 0.25 mm; Tstart: 70. C; Tend: 200. C |
Capillary | OV-101 | 1081. | Yang, Sugisawa, et al., 1992 | N2, 2. K/min; Column length: 50. m; Column diameter: 0.25 mm; Tstart: 80. C; Tend: 200. C |
Capillary | OV-101 | 1084. | Yang, Sugisawa, et al., 1992 | N2, 2. K/min; Column length: 50. m; Column diameter: 0.25 mm; Tstart: 80. C; Tend: 200. C |
Capillary | DB-1 | 1078. | Flath, Light, et al., 1990 | 50. C @ 0.1 min, 4. K/min; Column length: 60. m; Column diameter: 0.32 mm; Tend: 250. C |
Capillary | DB-5 | 1092. | Le Quere and Latrasse, 1990 | 60. m/0.32 mm/1. μm, He, 3. K/min; Tstart: 40. C; Tend: 220. C |
Capillary | OV-101 | 1078. | Pieribattesti, Smadja, et al., 1988 | H2, 2. K/min; Column length: 50. m; Column diameter: 0.32 mm; Tstart: 50. C; Tend: 200. C |
Capillary | CP Sil 5 CB | 1082. | Montanarella, Bos, et al., 1986 | N2, 4. K/min; Column length: 25. m; Column diameter: 0.22 mm; Tstart: 70. C; Tend: 295. C |
Capillary | OV-1 | 1075. | De Pooter, Omar, et al., 1985 | 30. m/0.5 mm/0.8 μm, He, 2. K/min; Tstart: 40. C; Tend: 220. C |
Capillary | OV-1 | 1078. | De Pooter, Omar, et al., 1985 | 30. m/0.5 mm/0.8 μm, He, 2. K/min; Tstart: 40. C; Tend: 220. C |

Van Den Dool and Kratz RI, non-polar column, custom temperature program

Column type | Active phase | I | Reference | Comment |
---|---|---|---|---|
Capillary | HP-5MS | 1089.8 | Andriamaharavo, 2014 | 30. m/0.25 mm/0.25 μm, He; Program: 60C (1 min) => 5 C/min => 210C => 10 C/min => 280C (15 min) |
Capillary | BPX-5 | 1088. | Dharmawan, Kasapis, et al., 2007 | 30. m/0.25 mm/0.25 μm, He; Program: 35C => 4C/min => 200C => 30C/min => 300C (3min) |
Capillary | BPX-5 | 1087. | Eyres, Marriott, et al., 2007 | 25. m/0.32 mm/0.50 μm, He; Program: 60 0C 6 0C/min -> 210 0C 10 0C/min -> 290 0C (20 min) |
Capillary | VF-5MS | 1081. | Carasek and Pawliszyn, 2006 | 30. m/0.25 mm/0.25 μm, He; Program: 40C(2min) => 5C/min => 200C (2min) => 30C/min => 260C |
Capillary | BPX-5 | 1093. | Cardeal, da Silva, et al., 2006 | 30. m/0.25 mm/0.25 μm; Program: 35C(5min) => 3C/min => 210C => 40C/min => 240C (4min) |
Capillary | DB-5 | 1088. | Özel, Gögüs, et al., 2006 | Program: not specified |
Capillary | SE-52 | 1089. | Sacchetti, Guerrini, et al., 2006 | 30. m/0.32 mm/0.15 μm, He; Program: 45C => 1C/min => 100C => 5C/min => 250C(10min) |
Capillary | SE-52 | 1089. | Bruni, Pellati, et al., 2005 | 30. m/0.32 mm/0.15 μm, He; Program: 45C => 1C/min => 100C => 5C/min => 250C(10min) |
Capillary | SE-52 | 1082. | Lorenzo, Paz, et al., 2005 | 25. m/0.32 mm/0.43 μm, H2; Program: 60C(8min) => 3C/min => 180C => 20C/min => 250C(10min) |
Capillary | 5 % Phenyl methyl siloxane | 1089. | Sacchetti, Maietti, et al., 2005 | 30. m/0.32 mm/0.15 μm, He; Program: 45C => 1C/min => 100C => 5C/min => 250C (10min) |
Capillary | DB-5 | 1086. | Wang, Finn, et al., 2005 | 30. m/0.32 mm/1. μm, He; Program: 40C(2min) => 5C/min => 100C => 4C/min => 230C (10min) |
Capillary | DB-5 | 1099. | Wang, Finn, et al., 2005 | 30. m/0.32 mm/1. μm, He; Program: 40C(2min) => 5C/min => 100C => 4C/min => 230C (10min) |
Capillary | DB-5MS | 1089. | Zheng, Kim, et al., 2005 | 30. m/0.25 mm/0.25 μm, He; Program: 40 (5min) => 4C/min => 140C => 4C/min => 200C (20min) |
Capillary | DB-5MS | 1091. | Zheng, Kim, et al., 2005 | 30. m/0.25 mm/0.25 μm, He; Program: 40 (5min) => 4C/min => 140C => 4C/min => 200C (20min) |
Capillary | SPB-1 | 1081. | Díaz-Maroto, Sánchez Palomo, et al., 2004 | 50. m/0.25 mm/0.25 μm; Program: 70C(3min) => 4C/min => 120C => 8C/min => 250C |
Capillary | SE-52 | 1087. | Frizzo, Lorenzo, et al., 2004 | 25. m/0.32 mm/0.43 μm, H2; Program: 60C(8min) => 3C/min => 180C => 20C/min => 250C(10min) |
Capillary | SE-52 | 1085. | Lorenzo, Paz, et al., 2004 | 25. m/0.32 mm/0.4 μm; Program: 60C(8min) => 3C/min => 180C => 20C/min => 250C(10min) |
Capillary | SE-52 | 1089. | Sacchetti, Medici, et al., 2004 | 30. m/0.52 mm/0.15 μm, He; Program: 45C => 1C/min => 100C => 5C/min => 250C (10min) |
Capillary | DB-5MS | 1086. | Kim, Lee, et al., 2003 | 30. m/0.25 mm/0.25 μm, He; Program: 40C(5min) => 4C/min => 160C => 8C/min => 240C (15min) |
Capillary | DB-5 | 1099. | Klesk and Qian, 2003 | 30. m/0.25 mm/0.25 μm, He; Program: 40C(2min) => 5C/min => 100C => 4C/min => 230C(10min) |
Capillary | DB-5 | 1090. | Klesk and Qian, 2003, 2 | 30. m/0.32 mm/1. μm, He; Program: 40C(2min) => 2C/min => 100C => 10C/min => 230C (5min) |
Capillary | SE-52 | 1085. | Lorenzo, Loayza, et al., 2003 | 25. m/0.25 mm/0.25 μm, He; Program: 60C(8min) => 3C/min => 180C => 20C/min => 230C |
Capillary | CP Sil 8 CB | 1088. | Mockute and Judzentiene, 2003 | He; Column length: 50. m; Column diameter: 0.32 mm; Program: 60C (2min) => 5C/min => 160C (1min) => 10C/min => 250C (2min) |
Capillary | SE-52 | 1084. | Lorenzo, Loayza, et al., 2002 | 25. m/0.32 mm/0.40 μm, H2; Program: 60 C (8 min) 3 C/min -> 180 C 20 C/min -> 250 C (10 min) |
Capillary | BP-1 | 1080. | Cavalli, Ranarivelo, et al., 2001 | 50. m/0.22 mm/0.25 μm; Program: not specified |
Capillary | DB-1 | 1085. | Eri, Khoo, et al., 2000 | 60. m/0.25 mm/0.25 μm, He; Program: -20C (5min) => 10C/min => 100C => 4C/min => 200C => 10C/min => 280C |
Capillary | BP-1 | 1080. | Filippini, Tomi, et al., 2000 | Program: not specified |
Capillary | DB-5 | 1081. | Boulanger, Chassagne, et al., 1999 | 30. m/0.25 mm/0.25 μm, H2; Program: 40C(5min) => 2C/min => 220C => 5C/min => 250C(15min) |
Capillary | DB-5 | 1088. | Boulanger, Chassagne, et al., 1999 | 30. m/0.25 mm/0.25 μm, H2; Program: 40C(5min) => 2C/min => 220C => 5C/min => 250C(15min) |
Capillary | SE-52 | 1087. | Loayza, de Groot, et al., 1999 | 25. m/0.25 mm/0.25 μm, He; Program: 60 0C (8 min) 3 K/min -> 180 0C 20 K/min -> 230 0C |
Capillary | BPX-5 | 1105. | Elmore, Erbahadir, et al., 1997 | 50. m/0.32 mm/0.5 μm, He; Program: 0C (5min) => 40C/min => 40C (2min) => 10C/min => 280C |
Capillary | SE-52 | 1088. | Mondello, Dugo, et al., 1995 | 60. m/0.32 mm/0.40 μm, He; Program: 45 C (6 min) 3 C/min -> 111 0C 2 C/min -> 160 C 3 C/min -> 300 C (15 min) |

Van Den Dool and Kratz RI, polar column, temperature ramp

Column type | Active phase | I | Reference | Comment |
---|---|---|---|---|
Capillary | RTX-Wax | 1280. | Bendahou, Muselli, et al., 2008 | 60. m/0.22 mm/0.25 μm, He, 2. K/min, 230. C @ 30. min; Tstart: 60. C |
Capillary | BP-20 | 1285. | Duquesnoy, Castola, et al., 2007 | 50. m/0.22 mm/0.25 μm, He, 2. K/min, 220. C @ 20. min; Tstart: 60. C |
Capillary | BP-20 | 1280. | Lesueur, de Rocca Serra, et al., 2007 | 50. m/0.22 mm/0.25 μm, He, 2. K/min, 220. C @ 20. min; Tstart: 60. C |
Capillary | HP-20M | 1262. | Maric, Jukic, et al., 2007 | 50. m/0.2 mm/0.2 μm, He, 70. C @ 4. min, 4. K/min, 180. C @ 15. min |
Capillary | RTX-Wax | 1263. | Muselli, Rossi, et al., 2007 | 60. m/0.22 mm/0.25 μm, He, 2. K/min, 230. C @ 30. min; Tstart: 60. C |
Capillary | RTX-Wax | 1281. | Paolini J., Costa J., et al., 2007 | 60. m/0.22 mm/0.25 μm, He, 2. K/min, 230. C @ 35. min; Tstart: 60. C |
Capillary | HP-20M | 1257. | Politeo, Jukic, et al., 2007 | 50. m/0.20 mm/0.20 μm, Helium, 70. C @ 4. min, 4. K/min, 180. C @ 15. min |
Capillary | HP-Innowax | 1278. | Saroglou, Marin, et al., 2007 | 30. m/0.25 mm/0.5 μm, He, 3. K/min; Tstart: 60. C; Tend: 260. C |
Capillary | Supelcowax-10 | 1319. | Arena, Guarrera, et al., 2006 | 30. m/0.32 mm/0.5 μm, He, 70. C @ 7. min, 4. K/min, 220. C @ 20. min |
Capillary | BP-20 | 1275. | Boti, Bighelli, et al., 2006 | 50. m/0.22 mm/0.25 μm, He, 2. K/min, 220. C @ 20. min; Tstart: 60. C |
Capillary | RTX-Wax | 1279. | Cavalli, Tomi, et al., 2006 | 60. m/0.22 mm/0.25 μm, He, 2. K/min, 230. C @ 45. min; Tstart: 60. C |
Capillary | Polyethylene Glycol | 1290. | Dob, Dahmane, et al., 2006, 2 | 30. m/0.32 mm/0.25 μm, N2, 50. C @ 10. min, 2. K/min, 230. C @ 15. min |
Capillary | HP-Wax | 1288. | Flamini, Tebano, et al., 2006 | 30. m/0.25 mm/0.25 μm, N2, 60. C @ 10. min, 5. K/min; Tend: 220. C |
Capillary | BP-20 | 1282. | Gonny, Cavaleiro, et al., 2006 | 50. m/0.22 mm/0.25 μm, He, 2. K/min, 220. C @ 20. min; Tstart: 60. C |
Capillary | DB-Wax | 1271. | Osorio, Alarcon, et al., 2006 | 30. m/0.25 mm/0.25 μm, He, 50. C @ 4. min, 4. K/min, 220. C @ 20. min |
Capillary | DB-Wax | 1278. | Pala-Paul, Copeland, et al., 2006 | 60. m/0.32 mm/0.25 μm, He, 3. K/min; Tstart: 35. C; Tend: 220. C |
Capillary | RTX-Wax | 1262. | Paolini J., Desjobert J.M., et al., 2006 | 60. m/0.22 mm/0.25 μm, He, 2. K/min, 230. C @ 35. min; Tstart: 60. C |
Capillary | Supelcowax-10 | 1288. | Pinto, Pina-Vaz, et al., 2006 | 30. m/0.2 mm/0.2 μm, He, 3. K/min, 220. C @ 15. min; Tstart: 70. C |
Capillary | PEG-20M | 1292. | Rubiolo P., Matteodo M., et al., 2006 | 25. m/0.25 mm/0.3 μm, He, 50. C @ 1. min, 3. K/min, 220. C @ 5. min |
Capillary | Supelcowax-10 | 1288. | Salgueiro L.R., Pinto E., et al., 2006 | 30. m/0.2 mm/0.2 μm, He, 3. K/min, 220. C @ 15. min; Tstart: 70. C |
Capillary | DB-Wax | 1266. | Varming, Andersen, et al., 2006 | 30. m/0.25 mm/0.25 μm, He, 40. C @ 10. min, 6. K/min, 240. C @ 25. min |
Capillary | DB-Wax | 1264. | Berlinet, Ducruet, et al., 2005 | 30. m/0.25 mm/0.25 μm, He, 3. K/min, 250. C @ 20. min; Tstart: 40. C |
Capillary | BP-20 | 1282. | Boti J.B., Koukoua G., et al., 2005 | 50. m/0.22 mm/0.25 μm, He, 2. K/min, 220. C @ 20. min; Tstart: 60. C |
Capillary | DB-Wax | 1294. | Choi, 2005 | 60. m/0.25 mm/0.25 μm, N2, 70. C @ 2. min, 2. K/min, 230. C @ 20. min |
Capillary | RTX-Wax | 1269. | Cozzani, Muselli, et al., 2005 | 60. m/0.22 mm/0.25 μm, 2. K/min, 220. C @ 20. min; Tstart: 60. C |
Capillary | DB-Wax | 1269. | Fanciullino, Gancel, et al., 2005 | 30. m/0.25 mm/0.25 μm, He, 3. K/min, 250. C @ 20. min; Tstart: 40. C |
Capillary | BP-20 | 1280. | Ferrari, Tomi, et al., 2005 | 50. m/0.22 mm/0.25 μm, He, 2. K/min, 220. C @ 20. min; Tstart: 60. C |
Capillary | DB-Wax | 1271. | Gancel, Ollitrault, et al., 2005 | 30. m/0.25 mm/0.25 μm, He, 3. K/min, 250. C @ 20. min; Tstart: 40. C |
Capillary | Innowax | 1267. | Lee, Lee, et al., 2005 | 50. m/0.25 mm/0.25 μm, He, 50. C @ 3. min, 2. K/min, 220. C @ 20. min |
Capillary | DB-Wax | 1287. | Njoroge, Koaze, et al., 2005 | 60. m/0.25 mm/0.25 μm, N2, 70. C @ 2. min, 2. K/min, 230. C @ 20. min |
Capillary | DB-Wax | 1280. | Seo and Baek, 2005 | 30. m/0.25 mm/0.25 μm, He, 2. K/min, 200. C @ 20. min; Tstart: 40. C |
Capillary | Supelcowax-10 | 1254. | Smadja, Rondeau, et al., 2005 | 60. m/0.2 mm/0.2 μm, He, 2. K/min, 200. C @ 10. min; Tstart: 60. C |
Capillary | BP-20 | 1281. | Vellutini, Baldovini, et al., 2005 | 50. m/0.22 mm/0.25 μm, He, 2. K/min, 230. C @ 35. min; Tstart: 60. C |
Capillary | Megawax | 1260. | Verzera, Trozzi, et al., 2005 | 30. m/0.25 mm/0.25 μm, He, 40. C @ 6. min, 2. K/min, 220. C @ 10. min |
Capillary | PEG-20M | 1270. | Zhang, Xu, et al., 2005 | 30. m/0.25 mm/0.25 μm, N2, 50. C @ 8. min, 4. K/min, 220. C @ 20. min |
Capillary | HP-Wax | 1288. | Bertoli, Pistelli, et al., 2004 | 30. m/0.25 mm/0.25 μm, N2, 60. C @ 10. min, 5. K/min; Tend: 220. C |
Capillary | DB-Wax | 1280. | Brophy, Goldsack, et al., 2004 | 60. m/0.32 mm/0.25 μm, He, 3. K/min; Tstart: 32. C; Tend: 220. C |
Capillary | RTX-Wax | 1265. | Dugo, Mondello, et al., 2004 | 30. m/0.25 mm/0.25 μm, He, 45. C @ 6. min, 3. K/min, 240. C @ 10. min |
Capillary | HP-Wax | 1284. | Flamini, Bader, et al., 2004 | 30. m/0.25 mm/0.25 μm, He, 3. K/min; Tstart: 60. C; Tend: 240. C |
Capillary | HP-Wax | 1286. | Flamini, Cioni, et al., 2004 | 30. m/0.25 mm/0.25 μm, N2, 3. K/min; Tstart: 60. C; Tend: 240. C |
Capillary | HP-Wax | 1286. | Flamini, Cioni, et al., 2004 | 30. m/0.25 mm/0.25 μm, N2, 3. K/min; Tstart: 60. C; Tend: 240. C |
Capillary | BP-20 | 1272. | Gonny, Bradesi, et al., 2004 | 50. m/0.22 mm/0.25 μm, 2. K/min, 220. C @ 20. min; Tstart: 60. C |
Capillary | HP-Innowax | 1290. | Grujic-Jovanovic, Skaltsa, et al., 2004 | 30. m/0.25 mm/0.5 μm, He, 3. K/min; Tstart: 60. C; Tend: 260. C |
Capillary | DB-Wax | 1279. | Rega, Fournier, et al., 2004 | 30. m/0.32 mm/0.5 μm, He, 40. C @ 5. min, 5. K/min; Tend: 240. C |
Capillary | BP-20 | 1277. | Tam, Thuam, et al., 2004 | 50. m/0.22 mm/0.25 μm, He, 2. K/min, 220. C @ 20. min; Tstart: 60. C |
Capillary | DB-Wax | 1265. | Varming, Andersen, et al., 2004 | 30. m/0.25 mm/0.25 μm, He, 40. C @ 10. min, 6. K/min, 240. C @ 25. min |
Capillary | DB-Wax | 1263. | Yu, Kim, et al., 2004 | 30. m/0.25 mm/0.25 μm, He, 40. C @ 5. min, 4. K/min, 200. C @ 20. min |
Capillary | DB-Wax | 1266. | Yu, Kim, et al., 2004 | 30. m/0.25 mm/0.25 μm, He, 40. C @ 5. min, 4. K/min, 200. C @ 20. min |
Capillary | DB-Wax | 1261. | Yu, Kim, et al., 2004, 2 | 30. m/0.25 mm/0.25 μm, He, 40. C @ 5. min, 4. K/min, 200. C @ 20. min |
Capillary | DB-Wax | 1258. | Yu, Kim, et al., 2004, 2 | 30. m/0.25 mm/0.25 μm, He, 40. C @ 5. min, 4. K/min, 200. C @ 20. min |
Capillary | HP-Wax | 1285. | Bader, Caponi, et al., 2003 | 30. m/0.25 mm/0.25 μm, N2, 60. C @ 10. min, 5. K/min; Tend: 220. C |
Capillary | HP-Wax | 1286. | Bader, Caponi, et al., 2003, 2 | 30. m/0.25 mm/0.25 μm, N2, 60. C @ 10. min, 5. K/min; Tend: 220. C |
Capillary | BP-20 | 1279. | Bianchini, Tomi, et al., 2003 | 50. m/0.22 mm/0.25 μm, He, 2. K/min, 230. C @ 35. min; Tstart: 60. C |
Capillary | BP-20 | 1279. | Bianchini, Tomi, et al., 2003 | 50. m/0.22 mm/0.25 μm, He, 2. K/min, 230. C @ 35. min; Tstart: 60. C |
Capillary | Carbowax 20M | 1285. | Bicchi, Rubiolo, et al., 2003 | 25. m/0.25 mm/0.3 μm, He, 50. C @ 1. min, 3. K/min, 200. C @ 20. min |
Capillary | DB-Wax | 1259. | Brat, Rega, et al., 2003 | 30. m/0.25 mm/0.25 μm, He, 3. K/min, 250. C @ 20. min; Tstart: 40. C |
Capillary | RTX-Wax | 1276. | Cavalli, Tomi, et al., 2003 | 60. m/0.22 mm/0.25 μm, He, 2. K/min, 230. C @ 45. min; Tstart: 60. C |
Capillary | DB-Wax | 1297. | Choi, 2003 | 60. m/0.25 mm/0.25 μm, N2, 70. C @ 2. min, 2. K/min, 230. C @ 20. min |
Capillary | HP-Wax | 1284. | Emilio Tomei, Manganelli, et al., 2003 | 30. m/0.25 mm/0.25 μm, N2, 60. C @ 10. min, 5. K/min; Tend: 220. C |
Capillary | DB-Wax | 1271. | Gancel, Ollitrault, et al., 2003 | 60. m/0.32 mm/0.25 μm, H2, 1.5 K/min, 245. C @ 20. min; Tstart: 40. C |
Capillary | CP-Wax 52CB | 1266. | Kjeldsen, Christensen, et al., 2003 | 50. m/0.25 mm/0.2 μm, He, 32. C @ 1. min, 1. K/min; Tend: 220. C |
Capillary | HP-20M | 1262. | Radonic and Milso, 2003 | 50. m/0.2 mm/0.2 μm, He, 70. C @ 4. min, 5. K/min, 180. C @ 10. min |
Capillary | DB-Wax | 1287. | Rega, Fournier, et al., 2003 | 30. m/0.32 mm/0.5 μm, 35. C @ 5. min, 5. K/min, 240. C @ 5. min |
Capillary | RTX-Wax | 1266. | Shellie, Marriott, et al., 2003 | 30. m/0.25 mm/0.25 μm, He, 45. C @ 6. min, 3. K/min; Tend: 250. C |
Capillary | HP-Innowax | 1278. | Skaltsa, Demetzos, et al., 2003 | 30. m/0.25 mm/0.5 μm, He, 3. K/min; Tstart: 60. C; Tend: 260. C |
Capillary | Megawax | 1260. | Verzera, Trozzi, et al., 2003 | 30. m/0.25 mm/0.25 μm, He, 40. C @ 6. min, 2. K/min, 220. C @ 10. min |
Capillary | DB-Wax | 1285. | Choi, Kim. M.-S.L., et al., 2002 | 60. m/0.25 mm/0.25 μm, N2, 2. K/min, 230. C @ 20. min; Tstart: 70. C |
Capillary | Innowax | 1289. | Couladis, Chinou, et al., 2002 | 30. m/0.25 mm/0.5 μm, He, 3. K/min, 260. C @ 10. min; Tstart: 60. C |
Capillary | BP-20 | 1278. | Lota, de Rocca Serra, et al., 2002 | 50. m/0.22 mm/0.25 μm, He, 2. K/min, 220. C @ 20. min; Tstart: 60. C |
Capillary | RTX-Wax | 1263. | Mondello, Zappia, et al., 2002 | 30. m/0.25 mm/0.25 μm, He, 45. C @ 6. min, 3. K/min, 250. C @ 10. min |
Capillary | AT-Wax | 1274. | Pino, Marbot, et al., 2002, 4 | 60. m/0.32 mm/0.25 μm, He, 65. C @ 10. min, 2. K/min, 250. C @ 60. min |
Capillary | BP-20 | 1277. | Pintore, Usai, et al., 2002 | 50. m/0.22 mm/0.25 μm, 2. K/min, 220. C @ 20. min; Tstart: 60. C |
Capillary | BP-20 | 1279. | Bianchini, Tomi, et al., 2001 | 50. m/0.22 mm/0.25 μm, He, 2. K/min, 230. C @ 35. min; Tstart: 60. C |
Capillary | HP-Innowax | 1279. | Couladis, Baziou, et al., 2001 | 30. m/0.25 mm/0.50 μm, He, 3. K/min, 260. C @ 10. min; Tstart: 60. C |
Capillary | CP-Wax 52CB | 1266. | Kjeldsen, Christensen, et al., 2001 | 50. m/0.25 mm/0.2 μm, 32. C @ 1. min, 1. K/min; Tend: 220. C |
Capillary | BP-20 | 1278. | Lota, Serra, et al., 2001 | 50. m/0.22 mm/0.25 μm, He, 2. K/min; Tstart: 60. C; Tend: 220. C |
Capillary | AT-Wax | 1274. | Pino and Marbot, 2001 | 60. m/0.32 mm/0.25 μm, He, 65. C @ 10. min, 2. K/min, 250. C @ 60. min |
Capillary | BP-20 | 1277. | Rezzi, Bighelli, et al., 2001 | 50. m/0.22 mm/0.25 μm, He, 2. K/min, 220. C @ 20. min; Tstart: 60. C |
Capillary | DB-Wax | 1284. | Bartley and Jacobs, 2000 | 60. m/0.5 mm/0.32 μm, He, 40. C @ 2. min, 4. K/min, 290. C @ 5. min |
Capillary | DB-Wax | 1283. | Brophy, Goldsack, et al., 2000 | 60. m/0.50 mm/1.0 μm, He, 3. K/min; Tstart: 60. C; Tend: 225. C |
Capillary | DB-Wax | 1283. | Brophy, Goldsack, et al., 2000, 2 | 60. m/0.53 mm/1.0 μm, He, 3. K/min; Tstart: 50. C; Tend: 220. C |
Capillary | DB-Wax | 1283. | Brophy, Goldsack, et al., 2000, 3 | 60. m/0.53 mm/1.0 μm, He, 3. K/min; Tstart: 50. C; Tend: 220. C |
Capillary | CP-Wax 52CB | 1290. | Chagonda, Makanda, et al., 2000 | 25. m/0.25 mm/0.15 μm, 40. C @ 5. min, 3. K/min; Tend: 220. C |
Capillary | CP-Wax 52CB | 1278. | Chevance, Farmer, et al., 2000 | 60. C @ 5. min, 4. K/min, 220. C @ 30. min; Column length: 50. m; Column diameter: 0.32 mm |
Capillary | DB-Wax | 1293. | Choi and Sawamura, 2000 | 60. m/0.25 mm/0.25 μm, N2, 70. C @ 2. min, 2. K/min, 230. C @ 20. min |
Capillary | BP-20 | 1278. | Lota, de Rocca Serra, et al., 2000 | 50. m/0.22 mm/0.25 μm, He, 2. K/min, 230. C @ 35. min; Tstart: 60. C |
Capillary | BP-20 | 1278. | Lota, de Rocca Serra, et al., 2000 | 50. m/0.22 mm/0.25 μm, He, 2. K/min, 230. C @ 35. min; Tstart: 60. C |
Capillary | HP-20M | 1262. | Milos and Radonic, 2000 | 50. m/0.2 mm/0.2 μm, 70. C @ 4. min, 4. K/min, 180. C @ 10. min |
Capillary | Megawax | 1260. | Verzera, Trozzi, et al., 2000 | 30. m/0.25 mm/0.25 μm, He, 40. C @ 6. min, 2. K/min, 220. C @ 10. min |
Capillary | DB-Wax | 1283. | Brophy, Goldsack, et al., 1999 | He, 3. K/min; Column length: 60. m; Column diameter: 0.53 mm; Tstart: 50. C; Tend: 220. C |
Capillary | CP-Wax 52CB | 1273. | Chevance and Farmer, 1999 | 60. C @ 5. min, 4. K/min, 220. C @ 30. min; Column length: 50. m; Column diameter: 0.32 mm |
Capillary | CP-Wax 52CB | 1273. | Chevance and Farmer, 1999, 2 | 60. C @ 5. min, 4. K/min, 220. C @ 30. min; Column length: 50. m; Column diameter: 0.32 mm |
Capillary | CP-Wax 52CB | 1281. | Chevance and Farmer, 1999, 2 | 40. C @ 5. min, 4. K/min, 220. C @ 30. min; Column length: 50. m; Column diameter: 0.32 mm |
Capillary | BP-20 | 1278. | Lota, Serra, et al., 1999 | 50. m/0.22 mm/0.25 μm, He, 2. K/min, 230. C @ 35. min; Tstart: 60. C |
Capillary | BP-20 | 1278. | Lota, Serra, et al., 1999 | 50. m/0.22 mm/0.25 μm, He, 2. K/min, 230. C @ 35. min; Tstart: 60. C |
Capillary | Innowax | 1274. | Stashenko, Cervantes, et al., 1999 | 60. m/0.25 mm/0.25 μm, He, 50. C @ 5. min, 2.5 K/min; Tend: 180. C |
Capillary | Carbowax 20M | 1293. | Bicchi, Rubiolo, et al., 1998 | 25. m/0.25 mm/0.3 μm, H2, 50. C @ 1. min, 3. K/min, 200. C @ 20. min |
Capillary | DB-Wax | 1281. | Brophy, Forster, et al., 1998 | He, 3. K/min; Column length: 60. m; Column diameter: 0.32 mm; Tstart: 35. C; Tend: 220. C |
Capillary | SP-1000 | 1283. | Brophy, Forster, et al., 1998, 2 | He, 3. K/min; Column length: 85. m; Column diameter: 0.5 mm; Tstart: 60. C; Tend: 225. C |
Capillary | DB-Wax | 1283. | Brophy, Goldsack, et al., 1998 | He, 3. K/min; Column length: 60. m; Column diameter: 0.32 mm; Tstart: 65. C; Tend: 225. C |
Capillary | DB-Wax | 1283. | Brophy, Goldsack, et al., 1998, 2 | He, 3. K/min; Column length: 60. m; Column diameter: 0.32 mm; Tstart: 35. C; Tend: 220. C |
Capillary | DB-Wax | 1264. | Ollé, Baumes, et al., 1998 | 30. m/0.32 mm/0.5 μm, 40. C @ 3. min, 3. K/min, 245. C @ 20. min |
Capillary | DB-Wax | 1283. | Brophy, Goldsack, et al., 1997 | He, 3. K/min; Column length: 60. m; Column diameter: 0.32 mm; Tstart: 65. C; Tend: 225. C |
Capillary | SP-1000 | 1283. | Brophy, Goldsack, et al., 1997, 2 | He, 3. K/min; Column length: 85. m; Column diameter: 0.5 mm; Tstart: 65. C; Tend: 225. C |
Capillary | BP-20 | 1280. | Mariotti, Costa, et al., 1997 | 50. m/0.22 mm/0.25 μm, He, 2. K/min, 230. C @ 35. min; Tstart: 60. C |
Capillary | BP-20 | 1273. | Mariotti, Tomi, et al., 1997 | 50. m/0.22 mm/0.25 μm, He, 2. K/min, 230. C @ 35. min; Tstart: 60. C |
Capillary | DB-Wax | 1278. | Möllenbeck, König, et al., 1997 | 25. m/0.25 mm/0.25 μm, He, 50. C @ 3. min, 4. K/min; Tend: 240. C |
Capillary | CP-Wax 52CB | 1270. | Chyau, Mau, et al., 1996 | 50. m/0.23 mm/0.12 μm, H2, 50. C @ 10. min, 1.5 K/min, 200. C @ 10. min |
Capillary | Supelcowax-10 | 1285. | Granicher, Christen, et al., 1995 | 60. m/0.25 mm/0.25 μm, He, 60. C @ 5. min, 5. K/min, 230. C @ 20. min |
Capillary | Carbowax 20M | 1280. | Mondello, Dugo, et al., 1995 | 60. m/0.32 mm/0.425 μm, He, 45. C @ 3. min, 3. K/min, 300. C @ 20. min |
Capillary | Carbowax 20M | 1293. | Píry, Príbela, et al., 1995 | 50. m/0.2 mm/0.2 μm, He, 30. C @ 2. min, 4. K/min, 170. C @ 20. min |
Capillary | DB-Wax | 1290. | Combariza, Tirado, et al., 1994 | 60. m/0.25 mm/0.25 μm, He, 50. C @ 10. min, 2. K/min, 150. C @ 20. min |
Capillary | CP-Wax 52CB | 1290. | Wu and Yang, 1994 | H2, 50. C @ 10. min, 1.5 K/min, 200. C @ 40. min; Column length: 50. m; Column diameter: 0.32 mm |
Capillary | HP-20M | 1275. | Chung, Eiserich, et al., 1993 | He, 3. K/min; Column length: 50. m; Column diameter: 0.25 mm; Tstart: 60. C; Tend: 190. C |
Capillary | HP-FFAP | 1315. | Chung, Eiserich, et al., 1993 | He, 3. K/min; Column length: 50. m; Column diameter: 0.25 mm; Tstart: 60. C; Tend: 210. C |
Capillary | DB-Wax | 1282. | Shiratsuchi, Shimoda, et al., 1993 | 60. m/0.25 mm/0.25 μm, 50. C @ 4. min, 2. K/min, 230. C @ 30. min |
Capillary | DB-Wax | 1282. | Shiratsuchi, Shimoda, et al., 1993 | 60. m/0.25 mm/0.25 μm, 50. C @ 4. min, 2. K/min, 230. C @ 30. min |
Capillary | Carbowax 20M | 1287. | Suárez and Duque, 1992 | 25. m/0.31 mm/0.3 μm, 2. K/min; Tstart: 50. C; Tend: 200. C |
Capillary | Carbowax 20M | 1284. | Suárez and Duque, 1991 | 2. K/min; Column length: 25. m; Column diameter: 0.31 mm; Tstart: 50. C; Tend: 200. C |
Capillary | Carbowax 20M | 1287. | Suárez and Duque, 1991 | 2. K/min; Column length: 25. m; Column diameter: 0.31 mm; Tstart: 50. C; Tend: 200. C |
Capillary | Carbowax 20M | 1239. | Kawakami, Sachs, et al., 1990 | He, 60. C @ 4. min, 2. K/min; Column length: 50. m; Column diameter: 0.25 mm; Tend: 180. C |
Capillary | DB-Wax | 1284. | Le Quere and Latrasse, 1990 | 30. m/0.32 mm/0.5 μm, He, 3. K/min; Tstart: 40. C; Tend: 220. C |
Capillary | DB-Wax | 1276. | Fröhlich, Duque, et al., 1989 | 30. m/0.25 mm/0.25 μm, He, 50. C @ 3. min, 4. K/min; Tend: 250. C |
Capillary | DB-Wax | 1280. | Fröhlich, Duque, et al., 1989 | 30. m/0.25 mm/0.25 μm, He, 50. C @ 3. min, 4. K/min; Tend: 250. C |
Capillary | Carbowax 20M | 1263. | Chen and Ho, 1988 | He, 1.5 K/min, 225. C @ 80. min; Column length: 60. m; Column diameter: 0.32 mm; Tstart: 50. C |
Capillary | Carbowax 20M | 1261. | Chen, Kuo, et al., 1982 | He, 50. C @ 10. min, 1. K/min; Tend: 160. C |

Van Den Dool and Kratz RI, polar column, custom temperature program

Column type | Active phase | I | Reference | Comment |
---|---|---|---|---|
Capillary | Supelcowax-10 | 1278. | Bianchi, Cantoni, et al., 2007 | 30. m/0.25 mm/0.25 μm; Program: 35C(8min) => 4C/min => 60C => 6C/min => 160C => 20C/min => 220C(1min) |
Capillary | Supelcowax-10 | 1276. | Bianchi, Careri, et al., 2007 | 30. m/0.25 mm/0.25 μm, He; Program: 35C(8min) => 4C/min => 60C => 6C/min => 160C => 20C/min => 200C(1min) |
Capillary | Supelcowax-10 | 1280. | Bianchi, Careri, et al., 2007 | 30. m/0.25 mm/0.25 μm, He; Program: 35C(8min) => 4C/min => 60C => 6C/min => 160C => 20C/min => 200C(1min) |
Capillary | Supelcowax-10 | 1278. | Bianchi, Careri, et al., 2007 | 30. m/0.25 mm/0.25 μm, He; Program: 35C(8min) => 4C/min => 60C => 6C/min => 160C => 20C/min => 200C(1min) |
Capillary | CP-Wax 52CB | 1298. | Condurso, Verzera, et al., 2006 | 60. m/0.25 mm/0.25 μm, He; Program: 45C(5min) => 10C/min => 80C => 2C/min => 240C |
Capillary | CP-Wax 52CB | 1272. | Kaack, Christensen, et al., 2005 | 50. m/0.25 mm/0.2 μm, He; Program: 33C(1.5min) => 1.5C/min => 60C(4min) => 2C/min => 100C => 8C/min => 220C(15min) |
Capillary | Stabilwax | 1278. | Wang, Finn, et al., 2005 | 30. m/0.32 mm/1. μm, He; Program: 40C(2min) => 5C/min => 100C => 4C/min => 230C (10min) |
Capillary | DB-Wax | 1266. | Zheng, Kim, et al., 2005 | 30. m/0.25 mm/0.25 μm, He; Program: 40 (5min) => 4C/min => 140C => 4C/min => 200C (20min) |
Capillary | DB-Wax | 1263. | Zheng, Kim, et al., 2005 | 30. m/0.25 mm/0.25 μm, He; Program: 40 (5min) => 4C/min => 140C => 4C/min => 200C (20min) |
Capillary | RTX-Wax | 1260. | Dugo, Mondello, et al., 2004 | Program: not specified |
Capillary | BP-20 | 1258. | Lorenzo, Loayza, et al., 2003 | 25. m/0.25 mm/0.25 μm, He; Program: 40C(8min) => 3C/min => 180C => 20C/min => 230C |
Capillary | Stabilwax | 1270. | Hudaib, Speroni, et al., 2002 | He; Program: 50C(8min) => 4C/min => 180C(10min) => 5C/min => 220C |
Capillary | RTX-Wax | 1283. | Cavalli, Ranarivelo, et al., 2001 | 60. m/0.25 mm/0.25 μm; Program: not specified |
Capillary | BP-20 | 1277. | Filippini, Tomi, et al., 2000 | Program: not specified |
Capillary | Carbowax 20M | 1233. | Lorenzo, Dellacassa, et al., 2000 | Program: not specified |
Capillary | HP-Innowax | 1280. | Bisio, Ciarallo, et al., 1998 | 30. m/0.25 mm/0.25 μm, He; Program: 60C(8min) => 3C/min => 180C(5min) => 40C/min => 250C |

Normal alkane RI, non-polar column, temperature ramp

Column type | Active phase | I | Reference | Comment |
---|---|---|---|---|
Capillary | HP-5 | 1090. | Bertuzzi, Tirillini, et al., 2013 | 30. m/0.25 mm/0.25 μm, Helium, 60. C @ 3. min, 4. K/min, 300. C @ 15. min |
Capillary | HP-5 MS | 1089. | Sardashti, Valizadeh, et al., 2013 | 60. m/0.25 mm/0.25 μm, Helium, 40. C @ 1. min, 3. K/min, 250. C @ 20. min |
Capillary | RTX-1 | 1082. | Bendiabdellah, El Amine Dib, et al., 2012 | 60. m/0.22 mm/0.25 μm, Helium, 2. K/min, 230. C @ 5. min; Tstart: 60. C |
Capillary | RTX-1 | 1082. | Bendiabdellah, El Amine Dib, et al., 2012 | 60. m/0.22 mm/0.25 μm, Helium, 2. K/min, 230. C @ 5. min; Tstart: 60. C |
Capillary | Mega-5 | 1088. | Dell'Agli, Sanna, et al., 2012 | 25. m/0.25 mm/0.25 μm, Helium, 50. C @ 1. min, 3. K/min, 220. C @ 5. min |
Capillary | Polydimethyl siloxane with 5 % Ph | 1080. | Priya, Prathapan, et al., 2012 | Helium, 5. K/min, 200. C @ 25. min; Column length: 30. m; Tstart: 80. C |
Capillary | HP-5 | 1084. | Velickovic, Ristic, et al., 2012 | 25. m/0.32 mm/0.52 μm, Hydrogen, 4. K/min, 280. C @ 10. min; Tstart: 40. C |
Capillary | HP-5 | 1084. | Velickovic, Ristic, et al., 2012 | 25. m/0.32 mm/0.52 μm, Hydrogen, 4. K/min, 280. C @ 10. min; Tstart: 40. C |
Capillary | HP-5 MS | 1089. | Zouari, Ayadi, et al., 2012 | 30. m/0.25 mm/0.25 μm, Helium, 50. C @ 1. min, 7. K/min, 250. C @ 5. min |
Capillary | HP-1 | 1087. | Alizadeh, Khosh-Khui, et al., 2011 | 30. m/0.25 mm/0.25 μm, Helium, 3. K/min; Tstart: 60. C; Tend: 240. C |
Capillary | CP-Sil 5 CB | 1086. | Esseien, Aboaba, et al., 2011 | 25. m/0.25 mm/0.15 μm, Hydrogen, 3. K/min; Tstart: 50. C; Tend: 230. C |
Capillary | VF-5 MS | 1086. | Leffingwell and Alford, 2011 | 60. m/0.32 mm/0.25 μm, Helium, 2. K/min, 260. C @ 28. min; Tstart: 30. C |
Capillary | VF-5 MS | 1087. | Leffingwell and Alford, 2011 | 60. m/0.32 mm/0.25 μm, Helium, 2. K/min, 260. C @ 28. min; Tstart: 30. C |
Capillary | SE-30 MS | 1089. | Menichini, Tundis, et al., 2011 | 30. m/0.25 mm/0.25 μm, Helium, 50. C @ 5. min, 5. K/min, 250. C @ 10. min |
Capillary | CP-Sil 5 CB | 1080. | Mothana, Hasson, et al., 2011 | 30. m/0.25 mm/0.26 μm, Nitrogen, 3. K/min, 280. C @ 22. min; Tstart: 45. C |
Capillary | ZB-5 MS | 1087. | Boix, Victorio, et al., 2010 | 30. m/0.25 mm/0.25 μm, Helium, 5. K/min; Tstart: 60. C; Tend: 290. C |
Capillary | DB-5 MS | 1085. | Chalchat, Figueredo, et al., 2010 | 25. m/0.30 mm/0.25 μm, Helium, 3. K/min; Tstart: 50. C; Tend: 240. C |
Capillary | DB-5 MS | 1085. | Chalchat, Figueredo, et al., 2010 | 25. m/0.30 mm/0.25 μm, Helium, 3. K/min; Tstart: 50. C; Tend: 240. C |
Capillary | RTX-1 | 1082. | Dib, Djabou, et al., 2010 | 60. m/0.22 mm/0.25 μm, Helium, 2. K/min, 230. C @ 30. min; Tstart: 60. C |
Capillary | DB-5 | 1084. | Georgiou, Koutsaviti, et al., 2010 | 30. m/0.32 mm/0.25 μm, Helium, 3. K/min; Tstart: 60. C; Tend: 280. C |
Capillary | DB-5 | 1089. | Ho, Wang, et al., 2010 | 30. m/0.25 mm/0.25 μm, Helium, 2. K/min; Tstart: 50. C; Tend: 250. C |
Capillary | HP-5 | 1089. | Kahriman, Tosun, et al., 2010 | 30. m/0.32 mm/0.25 μm, Helium, 60. C @ 2. min, 3. K/min; Tend: 240. C |
Capillary | HP-5 MS | 1093. | Lazarevic, Radulovic, et al., 2010 | 30. m/0.25 mm/0.25 μm, Helium, 5. K/min; Tstart: 70. C; Tend: 290. C |
Capillary | DB-5 MS | 1090. | Mesa-Arango, Betancur-Galvis, et al., 2010 | 60. m/0.25 mm/0.25 μm, Helium, 40. C @ 15. min, 5. K/min, 250. C @ 15. min |
Capillary | DB-1 | 1083. | Mirjalili, Salehi, et al., 2010 | 25. m/0.25 mm/0.25 μm, Nitrogen, 60. C @ 1. min, 4. K/min, 250. C @ 10. min |
Capillary | HP-5 | 1086. | Monsef-Esfahani, Miri, et al., 2010 | 30. m/0.25 mm/0.25 μm, Helium, 50. C @ 5. min, 3. K/min; Tend: 240. C |
Capillary | HP-5 MS | 1090. | Ogunwande, Flamini, et al., 2010 | 30. m/0.25 mm/0.25 μm, Helium, 60. C @ 10. min, 5. K/min; Tend: 220. C |
Capillary | HP-5 MS | 1088. | Pino, Marquez, et al., 2010 | 30. m/0.32 mm/0.25 μm, Helium, 50. C @ 2. min, 4. K/min, 240. C @ 10. min |
Capillary | HP-5 MS | 1084. | Pripdeevech, Chumpolsri, et al., 2010 | 30. m/0.25 mm/0.25 μm, Helium, 2. K/min; Tstart: 100. C; Tend: 220. C |
Capillary | HP-5 | 1094. | Radulovic, Dordevic, et al., 2010 | 30. m/0.25 mm/0.25 μm, Hydrogen, 5. K/min; Tstart: 70. C; Tend: 290. C |
Capillary | SLB-5 MS | 1086. | Scandinaro, Tranchida, et al., 2010 | 10. m/0.10 mm/0.10 μm, Helium, 10. K/min; Tstart: 50. C; Tend: 250. C |
Capillary | SLB-5 MS | 1086. | Scandinaro, Tranchida, et al., 2010 | 10. m/0.10 mm/0.10 μm, Helium, 10. K/min; Tstart: 50. C; Tend: 250. C |
Capillary | DB-1-MS | 1077. | Takeoka, Hobbs, et al., 2010 | 60. m/0.25 mm/0.25 μm, Helium, 30. C @ 4. min, 2. K/min, 200. C @ 35. min |
Capillary | CP Sil 5 CB | 1087. | Usman, Zubair, et al., 2010 | 25. m/0.25 mm/0.15 μm, 3. K/min; Tstart: 50. C; Tend: 230. C |
Capillary | DB-5 | 1090. | Vahirua-Lechat, Mitermite, et al., 2010 | 30. m/0.25 mm/0.25 μm, Helium, 3. K/min, 240. C @ 2. min; Tstart: 80. C |
Capillary | DB-5 | 1089. | Yang, Zhang, et al., 2010 | 30. m/0.25 mm/0.25 μm, Helium, 40. C @ 1. min, 10. K/min, 250. C @ 3. min |
Capillary | HP-5MS | 1093. | Zouari, Zouari, et al., 2010 | 30. m/0.25 mm/0.25 μm, Helium, 50. C @ 1. min, 7. K/min, 250. C @ 5. min |
Capillary | SE-54 | 1086. | Dayisoylu and Alma, 2009 | 30. m/0.25 mm/0.25 μm, Helium, 60. C @ 5. min, 2. K/min, 260. C @ 999. min |
Capillary | DB-5 | 1088. | El-Massry, El-Ghorab, et al., 2009 | 30. m/0.25 mm/0.25 μm, Helium, 3. K/min, 220. C @ 40. min; Tstart: 35. C |
Capillary | HP-5 MS | 1091. | Farhat, Ginies, et al., 2009 | 30. m/0.25 mm/0.25 μm, Helium, 60. C @ 8. min, 2. K/min, 250. C @ 15. min |
Capillary | ZB-5 | 1040. | Gardini, Beletti, et al., 2009 | 30. m/0.25 mm/0.25 μm, Helium, 3. K/min, 240. C @ 1. min; Tstart: 50. C |
Capillary | SPB-5 | 1094. | Gauvin-Bialecki and Marodon, 2009 | 60. m/0.35 mm/0.25 μm, Nitrogen, 4. K/min, 230. C @ 40. min; Tstart: 60. C |
Capillary | SPB-5 | 1107. | Gilani, Shah, et al., 2009 | 30. m/0.53 mm/0.50 μm, Nitrogen, 50. C @ 5. min, 3. K/min, 210. C @ 45. min |
Capillary | DB-5 | 1089. | Ho, Wang, et al., 2009 | 30. m/0.25 mm/0.25 μm, Helium, 50. C @ 2. min, 5. K/min; Tend: 250. C |
Capillary | DB-5 | 1095. | Koba, Catherine, et al., 2009 | 30. m/0.25 mm/0.25 μm, Helium, 5. K/min; Tstart: 50. C; Tend: 250. C |
Capillary | HP-5 | 1088. | Lago, Favero, et al., 2009 | 30. m/0.32 mm/0.25 μm, Helium, 50. C @ 2. min, 5. K/min, 280. C @ 5. min |
Capillary | DB-5 | 1082. | Lawal and Oyedelji, 2009 | 30. m/0.25 mm/0.25 μm, Helium, 5. K/min; Tstart: 70. C; Tend: 240. C |
Capillary | HP-5 | 1083. | Maridass, 2009 | 25. m/0.20 mm/0.33 μm, Helium, 3. K/min, 240. C @ 7. min; Tstart: 60. C |
Capillary | RTX-1 | 1079. | Museli, Pau, et al., 2009 | 60. m/0.22 mm/0.25 μm, Helium, 2. K/min, 230. C @ 30. min; Tstart: 60. C |
Capillary | RTX-1 | 1082. | Museli, Pau, et al., 2009 | 60. m/0.22 mm/0.25 μm, Helium, 2. K/min, 230. C @ 30. min; Tstart: 60. C |
Capillary | DB-5 | 1088. | Porto, Decorti, et al., 2009 | 30. m/0.25 mm/0.25 μm, Helium, 45. C @ 3. min, 3. K/min, 250. C @ 5. min |
Capillary | DB-5 | 1082. | Rahmi-Nasrabadi, Gholivand, et al., 2009 | 30. m/0.25 mm/0.25 μm, Nitrogen, 40. C @ 1. min, 3. K/min, 250. C @ 10. min |
Capillary | 5 % Phenyl methyl siloxane | 1087. | Retta, Gattuso, et al., 2009 | 60. m/0.25 mm/0.25 μm, Helium, 3. K/min, 225. C @ 3. min; Tstart: 90. C |
Capillary | DB-5 | 1090. | Scrivanti, Anton, et al., 2009 | 30. m/0.25 mm/0.25 μm, Nitrogen, 2. K/min; Tstart: 40. C; Tend: 230. C |
Capillary | DB-5 | 1063. | de Souza, Lopes, et al., 2009 | 30. m/0.25 mm/0.25 μm, Helium, 40. C @ 1. min, 3. K/min; Tend: 240. C |
Capillary | DB-5 MS | 1088. | Su, Wang, et al., 2009 | 30. m/0.25 mm/0.25 μm, Helium, 40. C @ 2. min, 4. K/min, 250. C @ 2. min |
Capillary | HP-5MS | 1092. | Wannes, Mhamdi, et al., 2009 | 30. m/0.25 mm/0.25 μm, Helium, 5. K/min; Tstart: 50. C; Tend: 240. C |
Capillary | HP-5 MS | 1081. | Zaibunnisa, Norashikin, et al., 2009 | 30. m/0.25 mm/0.25 μm, Helium, 60. C @ 6. min, 10. K/min, 325. C @ 10. min |
Capillary | HP-5 | 1091. | Zhannan, Shiqiong, et al., 2009 | 30. m/0.32 mm/0.25 μm, Helium, 40. C @ 4. min, 4. K/min; Tend: 240. C |
Capillary | HP-5 MS | 1088. | Zhao, Zeng, et al., 2009 | 30. m/0.25 mm/0.25 μm, Helium, 4. K/min; Tstart: 50. C; Tend: 280. C |
Capillary | HP-5 | 1088. | Aicha, Ines, et al., 2008 | 30. m/0.25 mm/0.25 μm, Helium, 50. C @ 3. min, 9. K/min, 280. C @ 3. min |
Capillary | DB-5 | 1082. | Ali, Wurster, et al., 2008 | 30. m/0.25 mm/0.25 μm, Helium, 70. C @ 1. min, 3. K/min; Tend: 220. C |
Capillary | HP-5 MS | 1087. | Baziou, Couladis, et al., 2008 | 3. K/min; Column length: 30. m; Column diameter: 0.25 mm; Tstart: 60. C; Tend: 280. C |
Capillary | HP-5 | 1089. | Flamini, Tebano, et al., 2008 | 30. m/0.25 mm/0.25 μm, N2, 60. C @ 10. min, 5. K/min; Tend: 220. C |
Capillary | HP-5 MS | 1086. | Forero, Quijano, et al., 2008 | 30. m/0.25 mm/0.25 μm, Helium, 50. C @ 4. min, 4. K/min, 230. C @ 10. min |
Capillary | HP-5 | 1085. | Isidorov, Lech, et al., 2008 | 30. m/0.25 mm/0.25 μm, Helium, 3. K/min, 300. C @ 30. min; Tstart: 50. C |
Capillary | SLB-5 MS | 1086. | Lo Presti, Sciarrone, et al., 2008 | 30. m/0.25 mm/0.25 μm, Helium, 50. C @ 2. min, 3. K/min, 250. C @ 10. min |
Capillary | ZB-1 | 1072. | Mierendorff, Stahl-Biskup, et al., 2008 | 30. m/0.25 mm/0.25 μm, Nitrogen, 3. K/min; Tstart: 45. C; Tend: 230. C |
Capillary | DB-5 | 1093. | Mosayebi, Amin, et al., 2008 | 60. m/0.25 mm/0.25 μm, Nitrogen, 5. K/min, 250. C @ 10. min; Tstart: 60. C |
Capillary | BPX-5 | 1092. | Shellie, 2008 | 7.5 m/0.10 mm/10. μm, Helium, 3. K/min; Tstart: 60. C; Tend: 240. C |
Capillary | RTX-5 | 1094. | Skalicka-Wozniak, Los, et al., 2008 | 20. m/0.18 mm/0.20 μm, Helium, 50. C @ 1. min, 4. K/min; Tend: 280. C |
Capillary | HP-5 | 1089. | Verdian-rizi, 2008 | 25. m/0.25 mm/0.25 μm, Helium, 60. C @ 2. min, 4. K/min; Tend: 240. C |
Capillary | HP-5 | 1090. | Yassa and Akhani, 2008 | 30. m/0.25 mm/0.32 μm, Helium, 60. C @ 30. min, 5. K/min; Tend: 250. C |
Capillary | HP-5 MS | 1088. | Adams, Beauchamp, et al., 2007 | 30. m/0.25 mm/0.25 μm, Helium, 50. C @ 10. min, 3. K/min, 230. C @ 10. min |
Capillary | DB-5 | 1087. | Amiri, 2007 | 50. m/0.20 mm/0.32 μm, Nitrogen, 60. C @ 3. min, 5. K/min, 220. C @ 5. min |
Capillary | HP-5 | 1089. | Asekun, Olusegun, et al., 2007 | He, 5. K/min; Column length: 30. m; Column diameter: 0.25 mm; Tstart: 70. C; Tend: 240. C |
Capillary | CP Sil 5 CB | 1076. | Baran, von Reuss, et al., 2007 | 30. m/0.32 mm/0.25 μm, N2, 4. K/min; Tstart: 60. C; Tend: 300. C |
Capillary | HP-5MS | 1086. | Basta, Tzakou, et al., 2007 | 30. m/0.25 mm/0.25 μm, He, 3. K/min; Tstart: 60. C; Tend: 280. C |
Capillary | DB-5 | 1083. | Bos, Woerdenbag, et al., 2007 | 30. m/0.26 mm/0.25 μm, He, 3. K/min; Tstart: 60. C; Tend: 240. C |
Capillary | HP-5MS | 1088. | Bozin B., Mlmica-Dukic N., et al., 2007 | 30. m/0.25 mm/0.25 μm, He, 3. K/min; Tstart: 60. C; Tend: 280. C |
Capillary | HP-5 | 1088. | Cheraif, Ben Jannet, et al., 2007 | 30. m/0.25 mm/0.25 μm, N2, 50. C @ 1. min, 5. K/min, 240. C @ 4. min |
Capillary | DB-5 | 1083. | Elfami, Bos, et al., 2007 | 30. m/0.26 mm/0.25 μm, Helium, 3. K/min; Tstart: 60. C; Tend: 290. C |
Capillary | DB-1 | 1083. | Ghasempour, Shirinpour, et al., 2007 | 60. m/0.25 mm/0.25 μm, Nitrogen, 60. C @ 1. min, 4. K/min, 250. C @ 10. min |
Capillary | Col-Elite 5MS | 1097. | Gudaityte and Venskutonis R.P., 2007 | 30. m/0.25 mm/0.25 μm, He, 3. K/min; Tstart: 30. C; Tend: 246. C |
Capillary | DBP-5 | 1060. | Heravi and Sereshti, 2007 | 25. m/0.25 mm/0.22 μm, Helium, 40. C @ 1. min, 3. K/min, 250. C @ 10. min |
Capillary | RTX-5 MS | 1091. | Hudaib and Aburjai, 2007 | 30. m/0.25 mm/0.25 μm, He, 3. K/min; Tstart: 45. C; Tend: 210. C |
Capillary | DB-5 | 1080. | Limberger, Scopel, et al., 2007 | 30. m/0.25 mm/0.25 μm, He, 3. K/min; Tstart: 60. C; Tend: 300. C |
Capillary | SE-30 | 1089. | Loizzo, Tundis, et al., 2007 | 30. m/0.25 mm/0.25 μm, He, 40. C @ 5. min, 5. K/min, 250. C @ 10. min |
Capillary | HP-5 | 1086. | Loizzo, Tundis, et al., 2007 | 30. m/0.25 mm/0.25 μm, He, 40. C @ 5. min, 5. K/min, 250. C @ 10. min |
Capillary | ZB-5 | 1097. | Mohottalage, Tabacchi, et al., 2007 | 30. m/0.25 mm/0.25 μm, 60. C @ 5. min, 4. K/min, 220. C @ 20. min |
Capillary | DB-1 | 1073. | Monser-Esfahani, Karamkhani, et al., 2007 | 30. m/0.25 mm/0.25 μm, Helium, 50. C @ 1. min, 2.5 K/min, 260. C @ 20. min |
Capillary | DB-5 | 1061. | Moreno, Lima, et al., 2007 | 30. m/0.25 mm/0.25 μm, Helium, 3. K/min; Tstart: 60. C; Tend: 300. C |
Capillary | HP-5 | 1090. | Oliveira, Leitão, et al., 2007 | 25. m/0.2 mm/0.33 μm, H2, 3. K/min; Tstart: 60. C; Tend: 240. C |
Capillary | Methyl Silicone | 1088. | Ozcan and Chalchat, 2007 | Helium, 3. K/min; Column length: 50. m; Column diameter: 0.25 mm; Tstart: 50. C; Tend: 240. C |
Capillary | DB-1 | 1085. | Pala-Paul, Brophy, et al., 2007 | 50. m/0.25 mm/0.25 μm, He, 4. K/min; Tstart: 95. C; Tend: 240. C |
Capillary | SPB-1 | 1077. | Pinto, Salgueiro, et al., 2007 | 30. m/0.2 mm/0.2 μm, He, 3. K/min, 220. C @ 15. min; Tstart: 70. C |
Capillary | BPX-5 | 1111. | Rali, Wossa, et al., 2007 | 50. m/0.22 mm/1. μm, He, 50. C @ 1. min, 4. K/min, 300. C @ 10. min |
Capillary | BPX-5 | 1105. | Rali, Wossa, et al., 2007 | 50. m/0.22 mm/1. μm, He, 50. C @ 1. min, 4. K/min, 300. C @ 10. min |
Capillary | DB-1 | 1083. | Reza, Ebrahim, et al., 2007 | 60. m/0.25 mm/0.25 μm, Nitrogen, 60. C @ 1. min, 4. K/min, 250. C @ 10. min |
Capillary | DB-1 | 1082. | Salehi, Asghari, et al., 2007 | 60. m/0.25 mm/0.25 μm, 5. K/min; Tstart: 60. C; Tend: 250. C |
Capillary | DB-1 | 1081. | Salehi, Fakhari, et al., 2007 | 60. m/0.25 mm/0.25 μm, He, 5. K/min; Tstart: 60. C; Tend: 250. C |
Capillary | DB-5 | 1086. | Sefidkon, Abbasi, et al., 2007 | 30. m/0.25 mm/0.25 μm, He, 4. K/min; Tstart: 50. C; Tend: 240. C |
Capillary | DBP-5 | 1060. | Sereshti and Samadi, 2007 | 25. m/0.25 mm/0.22 μm, Helium, 40. C @ 1. min, 3. K/min, 250. C @ 10. min |
Capillary | DB-5 | 1098. | Sylvestre, Longtin, et al., 2007 | 30. m/0.25 mm/0.25 μm, 2. K/min, 210. C @ 33. min; Tstart: 40. C |
Capillary | DB-5 | 1097. | Sylvestre, Pichette, et al., 2007 | 30. m/0.25 mm/0.25 μm, 2. K/min, 250. C @ 33. min; Tstart: 40. C |
Capillary | Elite-5MS | 1085. | Tava, Pecetti, et al., 2007 | 30. m/0.32 mm/0.5 μm, He, 40. C @ 5. min, 4. K/min, 280. C @ 10. min |
Capillary | HP-5 MS | 1092. | Tsokou, Georgopoulos, et al., 2007 | 30. m/0.25 mm/0.25 μm, Helium, 3. K/min; Tstart: 60. C; Tend: 280. C |
Capillary | HP-5MS | 1052. | Tzakou, Bazos, et al., 2007 | 30. m/0.25 mm/0.25 μm, He, 3. K/min; Tstart: 60. C; Tend: 280. C |
Capillary | HP-5MS | 1083. | Vichi, Riu-Aumatell, et al., 2007 | 30. m/0.25 mm/0.25 μm, He, 40. C @ 5. min, 3. K/min, 250. C @ 10. min |
Capillary | HP-5 | 1090. | Yassa and Akhani, 2007 | 30. m/0.25 mm/0.32 μm, He, 60. C @ 30. min, 5. K/min; Tend: 250. C |
Capillary | HP-5 | 1080. | Abdelwahed, Hayder, et al., 2006 | 30. m/0.25 mm/0.25 μm, N2, 50. C @ 3. min, 9. K/min, 280. C @ 3. min |
Capillary | HP-5 | 1084. | Abdelwahed, Hayder, et al., 2006 | 30. m/0.25 mm/0.25 μm, N2, 50. C @ 3. min, 9. K/min, 280. C @ 3. min |
Capillary | CP Sil 5 CB | 1082. | Ayoub, Al-Azizi, et al., 2006 | He, 10. K/min; Column length: 25. m; Tstart: 80. C; Tend: 270. C |
Capillary | ZB-5 | 1087. | Biondi, Sari, et al., 2006 | 30. m/0.25 mm/0.25 μm, 2. K/min; Tstart: 40. C; Tend: 300. C |
Capillary | AT-5 | 1088. | Borges, Rojas, et al., 2006 | 60. m/0.25 mm/0.25 μm, He, 4. K/min, 200. C @ 20. min; Tstart: 60. C |
Capillary | BP-1 | 1076. | Boti, Muselli, et al., 2006 | 50. m/0.22 mm/0.25 μm, He, 2. K/min, 220. C @ 20. min; Tstart: 60. C |
Capillary | HP-1 | 1079. | Castel, Fernandez, et al., 2006 | 50. m/0.2 mm/0.5 μm, He, 2. K/min, 250. C @ 120. min; Tstart: 60. C |
Capillary | HP-1 | 1079. | Castel, Fernandez, et al., 2006 | 50. m/0.2 mm/0.33 μm, He, 60. C @ 4. min, 2. K/min, 250. C @ 30. min |
Capillary | SPB-1 | 1076. | Cavaleiro, Pinto, et al., 2006 | 30. m/0.20 mm/0.20 μm, Helium, 3. K/min, 220. C @ 15. min; Tstart: 70. C |
Capillary | DB-1 | 1077. | Chen, Sheu, et al., 2006 | Nitrogen, 40. C @ 1. min, 2. K/min, 200. C @ 9. min; Column length: 60. m; Column diameter: 0.25 mm |
Capillary | DB-5 | 1086. | Choi, 2006 | 30. m/0.25 mm/0.25 μm, N2, 70. C @ 2. min, 2. K/min, 230. C @ 20. min |
Capillary | HP-5 | 1087. | Coronel, Cerda-Garcia-Rojas, et al., 2006 | 30. m/0.32 mm/0.25 μm, He, 3. K/min; Tstart: 60. C; Tend: 246. C |
Capillary | DB-5 | 1077. | Damjanovic, Skala, et al., 2006 | 30. m/0.32 mm/0.25 μm, 3. K/min, 230. C @ 15. min; Tstart: 60. C |
Capillary | HP-5MS | 1091. | Ebrahim Sajjadi and Mehregan, 2006 | 30. m/0.25 mm/0.25 μm, 4. K/min; Tstart: 60. C; Tend: 280. C |
Capillary | DB-5 | 1083. | Elfami, Komar, et al., 2006 | 30. m/0.26 mm/0.25 μm, Helium, 3. K/min; Tstart: 60. C; Tend: 290. C |
Capillary | BP-1 | 1078. | Fanciullino, Tomi, et al., 2006 | 50. m/0.22 mm/0.25 μm, He, 2. K/min, 220. C @ 20. min; Tstart: 60. C |
Capillary | BP-1 | 1078. | Fanciullino, Tomi, et al., 2006 | 50. m/0.22 mm/0.25 μm, He, 2. K/min, 220. C @ 20. min; Tstart: 60. C |
Capillary | HP-5 | 1085. | Figuérédo, Cabassu, et al., 2006 | 30. m/0.25 mm/0.25 μm, He, 50. C @ 5. min, 5. K/min, 300. C @ 5. min |
Capillary | HP-1 | 1079. | Filippi, Lanfranchi, et al., 2006 | 50. m/0.2 mm/0.33 μm, He, 2. K/min, 250. C @ 40. min; Tstart: 60. C |
Capillary | DB-5 | 1084. | Havlik, Kokoska, et al., 2006 | 30. m/0.25 mm/0.25 μm, He, 3. K/min, 250. C @ 10. min; Tstart: 50. C |
Capillary | CP Sil 5 CB | 1089. | Hymete, Rohloff, et al., 2006 | 30. m/0.25 mm/0.25 μm, 3. K/min, 220. C @ 3. min; Tstart: 40. C |
Capillary | HP-5 | 1088. | Ibañez and Usubillaga, 2006 | 30. m/0.25 mm/0.25 μm, He, 4. K/min; Tstart: 60. C; Tend: 240. C |
Capillary | DB-5 | 1089. | Javidnia, Miri, et al., 2006 | 30. m/0.25 mm/0.25 μm, Helium, 3. K/min; Tstart: 60. C; Tend: 260. C |
Capillary | DB-1 | 1080. | Lan Phi N.T., Nishiyama C., et al., 2006 | 60. m/0.25 mm/0.25 μm, 70. C @ 2. min, 2. K/min, 230. C @ 20. min |
Capillary | CP Sil 8 CB | 1087. | Li, Lee, et al., 2006 | 30. m/0.25 mm/0.25 μm, 40. C @ 5. min, 3. K/min, 250. C @ 20. min |
Capillary | CP Sil 5 CB | 1082. | Lis and Milczarek, 2006 | 30. m/0.32 mm/0.25 μm, N2, 4. K/min; Tstart: 50. C; Tend: 300. C |
Capillary | CP Sil 5 CB | 1077. | Martin, Joseph, et al., 2006 | 30. m/0.25 mm/0.25 μm, N2, 5. K/min; Tstart: 50. C; Tend: 200. C |
Capillary | HP-5 MS | 1088. | Marzouk, Mansour, et al., 2006 | 30. m/0.25 mm/0.25 μm, Nitrogen, 5. K/min, 280. C @ 5. min; Tstart: 50. C |
Capillary | HP-5 | 1088. | Marzouk, Neffati, et al., 2006 | 30. m/0.25 mm/0.52 μm, N2, 5. K/min, 280. C @ 5. min; Tstart: 50. C |
Capillary | 5 % Phenyl methyl siloxane | 1054. | Marongiu, Piras, et al., 2006 | 30. m/0.25 mm/0.25 μm, Helium, 3. K/min, 280. C @ 30. min; Tstart: 60. C |
Capillary | DB-5 | 1086. | Mirza, Navaei, et al., 2006 | 30. m/0.25 mm/0.25 μm, Helium, 50. C @ 5. min, 3. K/min; Tend: 250. C |
Capillary | BP-1 | 1081. | Moody, Gundidza, et al., 2006 | He, 70. C @ 2. min, 4. K/min, 220. C @ 10. min; Column length: 25. m; Column diameter: 0.3 mm |
Capillary | DB-5 | 1091. | Morteza-Semnani, Akbarzadeh, et al., 2006 | 30. m/0.25 mm/0.25 μm, He, 4. K/min; Tstart: 60. C; Tend: 220. C |
Capillary | DB-5 | 1092. | Morteza-Semnani K., Saeedi M., et al., 2006 | 30. m/0.25 mm/0.25 μm, He, 60. C @ 5. min, 4. K/min; Tend: 220. C |
Capillary | NB-30 | 1080. | Orav, Raal, et al., 2006 | 30. m/0.2 mm/0.25 μm, He, 2. K/min; Tstart: 50. C; Tend: 250. C |
Capillary | DB-5 | 1085. | Ouamba, Ouabonzi, et al., 2006 | 25. m/0.25 mm/0.15 μm, N2, 50. C @ 3. min, 4. K/min; Tend: 200. C |
Capillary | DB-5 | 1088. | Ozel, Gogus, et al., 2006 | 30. m/0.32 mm/0.25 μm, He, 60. C @ 0.5 min, 5. K/min, 280. C @ 2. min |
Capillary | DB-1 | 1086. | Pala-Paul J., Perez-Alonso M.J., et al., 2006 | 50. m/0.25 mm/0.25 μm, N2, 4. K/min; Tstart: 95. C; Tend: 240. C |
Capillary | HP-5 | 1089. | Pintore G., Chessa M., et al., 2006 | 30. m/0.25 mm/0.25 μm, He, 60. C @ 10. min, 5. K/min; Tend: 220. C |
Capillary | DB-5 | 1089. | Pino, Marbot, et al., 2006 | 30. m/0.25 mm/0.25 μm, Hydrogen, 70. C @ 4. min, 4. K/min; Tend: 280. C |
Capillary | HP-5MS | 1054. | Pitarokili, Tzakou, et al., 2006 | 30. m/0.25 mm/0.25 μm, He, 3. K/min; Tstart: 60. C; Tend: 280. C |
Capillary | HP-5MS | 1088. | Robinson, 2006 | 30. m/0.25 mm/0.25 μm, 50. C @ 5. min, 10. K/min; Tend: 250. C |
Capillary | DB-5 | 1088. | Rout, Naik, et al., 2006 | 30. m/0.25 mm/0.25 μm, He, 2. K/min, 200. C @ 60. min; Tstart: 60. C |
Capillary | DB-5 | 1088. | Sabulal, Dan, et al., 2006 | 30. m/0.25 mm/0.25 μm, He, 5. K/min; Tstart: 60. C; Tend: 260. C |
Capillary | ZB-5 | 1087. | Sari M., Biondi D.M., et al., 2006 | 30. m/0.25 mm/0.25 μm, He, 2. K/min; Tstart: 40. C; Tend: 300. C |
Capillary | DB-1 | 1079. | Sawamura, Onishi, et al., 2006 | 60. m/0.25 mm/0.25 μm, 70. C @ 2. min, 2. K/min, 230. C @ 20. min |
Capillary | FSOT-RSL-200 | 1087. | Schmidt, Jirovetz, et al., 2006 | 30. m/0.32 mm/0.25 μm, Hydrogen, 40. C @ 5. min, 6. K/min, 280. C @ 5. min |
Capillary | DB-5 | 1087. | Sefidkon and Jamzad, 2006 | 30. m/0.25 mm/0.25 μm, He, 4. K/min; Tstart: 40. C; Tend: 240. C |
Capillary | DB-1 | 1078. | Sefidkon, Jamzad, et al., 2006 | He, 4. K/min; Column length: 60. m; Column diameter: 0.25 mm; Tstart: 40. C; Tend: 250. C |
Capillary | HP-5 | 1091. | Shafi, Jose, et al., 2006 | 25. m/0.2 mm/0.33 μm, N2, 3. K/min; Tstart: 30. C; Tend: 280. C |
Capillary | CP Sil 5 CB | 1089. | Tesso, Kubeczka, et al., 2006 | 3. K/min; Column length: 25. m; Column diameter: 0.25 mm; Tstart: 50. C; Tend: 230. C |
Capillary | SPB-5 | 1102. | Tornambe, Cornu, et al., 2006 | 60. m/0.32 mm/1. μm, He, 40. C @ 5. min, 3. K/min, 230. C @ 2. min |
Capillary | DB-5 | 1089. | Trilles, Bombarda, et al., 2006 | 30. m/0.25 mm/0.25 μm, N2, 4. K/min; Tstart: 60. C; Tend: 240. C |
Capillary | DB-1 | 1068. | Velasco-Negueruela, Pérez-Alonso, et al., 2006 | 50. m/0.25 mm/0.25 μm, N2, 4. K/min; Tstart: 90. C; Tend: 240. C |
Capillary | HP-5 | 1087. | Wang, Kong, et al., 2006 | 25. m/0.32 mm/0.52 μm, H2, 50. C @ 5. min, 2.5 K/min; Tend: 280. C |
Capillary | HP-5 | 1094. | Wang, Yang, et al., 2006 | 30. m/0.25 mm/0.25 μm, He, 60. C @ 2. min, 10. K/min, 250. C @ 10. min |
Capillary | SPB-1 | 1077. | Wong, Lim, et al., 2006 | 50. m/0.2 mm/0.33 μm, He, 50. C @ 1. min, 4. K/min, 220. C @ 10. min |
Capillary | SPB-1 | 1072. | Wong, Sivasothy, et al., 2006 | 30. m/0.25 mm/0.25 μm, He, 50. C @ 1. min, 4. K/min, 250. C @ 10. min |
Capillary | DB-5 | 1062. | Yadegarinia, Gachkar, et al., 2006 | 30. m/0.25 mm/0.25 μm, He, 4. K/min; Tstart: 40. C; Tend: 250. C |
Capillary | DB-5 | 1082. | Yadegarinia, Gachkar, et al., 2006 | 30. m/0.25 mm/0.25 μm, He, 4. K/min; Tstart: 40. C; Tend: 250. C |
Capillary | HP-5MS | 1083. | Basta, Tzakou, et al., 2005 | 30. m/0.25 mm/0.25 μm, He, 3. K/min; Tstart: 60. C; Tend: 280. C |
Capillary | DB-5 | 1085. | Bos, Stojanova, et al., 2005 | 30. m/0.249 mm/0.25 μm, He, 3. K/min; Tstart: 60. C; Tend: 290. C |
Capillary | DB-5 | 1095. | Chagonda and Chalchat, 2005 | 50. m/0.3 mm/0.25 μm, 2. K/min; Tstart: 60. C; Tend: 240. C |
Capillary | Methyl Silicone | 1088. | Chalchat and Özcan, 2005 | He, 3. K/min; Column length: 60. m; Column diameter: 0.3 mm; Tstart: 50. C; Tend: 240. C |
Capillary | SPB-5 | 1098. | Cornu, Kondjoyan, et al., 2005 | 60. m/0.32 mm/1. μm, He, 40. C @ 5. min, 3. K/min; Tend: 230. C |
Capillary | DB-1 | 1079. | Fakhari, Salehi, et al., 2005 | 60. m/0.25 mm/0.25 μm, He, 5. K/min; Tstart: 60. C; Tend: 250. C |
Capillary | HP-1 | 1077. | Fernandez, Lizzani-Cuvelier, et al., 2005 | 50. m/0.2 mm/0.25 μm, 60. C @ 60. min, 2. K/min; Tend: 250. C |
Capillary | HP-5 | 1085. | Figuérédo, Cabassu, et al., 2005 | 30. m/0.25 mm/0.25 μm, He, 50. C @ 5. min, 5. K/min, 300. C @ 5. min |
Capillary | HP-5MS | 1089. | Ghasemi Y., Faridi P., et al., 2005 | He, 50. C @ 3. min, 3. K/min, 250. C @ 10. min; Column length: 25. m; Column diameter: 0.25 mm |
Capillary | CP Sil 5 CB | 1086. | Jassbi, Mehrdad, et al., 2005 | 30. m/0.25 mm/0.25 μm, N2, 5. K/min, 250. C @ 10. min; Tstart: 60. C |
Capillary | RSL-200 | 1089. | Jirovetz, Buchbauer, et al., 2005 | 30. m/0.25 mm/0.25 μm, 40. C @ 2. min, 6. K/min, 280. C @ 10. min |
Capillary | DB-1 | 1072. | Khalighi-Sigaroodi, Hadijiakhoondi, et al., 2005 | 30. m/0.25 mm/0.25 μm, He, 50. C @ 1. min, 2.5 K/min, 265. C @ 30. min |
Capillary | HP-5 | 1086.5 | Leffingwell and Alford, 2005 | 60. m/0.32 mm/0.25 μm, He, 30. C @ 2. min, 2. K/min, 260. C @ 28. min |
Capillary | CP Sil 5 CB | 1083. | Ogunwande, Olawore, et al., 2005 | 25. m/0.25 mm/0.15 μm, 3. K/min; Tstart: 50. C; Tend: 230. C |
Capillary | CP Sil 5 CB | 1083. | Olawore, Ogunwande, et al., 2005 | 25. m/0.25 mm/0.15 μm, 3. K/min; Tstart: 50. C; Tend: 230. C |
Capillary | HP-5 | 1089. | Oyedeji, Yani, et al., 2005 | 30. m/0.25 mm/0.25 μm, He, 5. K/min; Tstart: 70. C; Tend: 240. C |
Capillary | RTX-5 MS | 1091. | Pellati, Benvenuti, et al., 2005 | 30. m/0.25 mm/0.25 μm, He, 50. C @ 2. min, 8. K/min, 280. C @ 2. min |
Capillary | HP-5MS | 1089. | Petrakis, Roussis, et al., 2005 | 3. K/min; Column length: 30. m; Column diameter: 0.2 mm; Tstart: 60. C; Tend: 280. C |
Capillary | SPB-5 | 1088. | Pino, Marbot, et al., 2005 | 30. m/0.25 mm/0.25 μm, He, 60. C @ 2. min, 4. K/min, 250. C @ 20. min |
Capillary | HP-5MS | 1091. | Pourmortazavi, Ghadiri, et al., 2005 | 30. m/0.25 mm/0.32 μm, He, 60. C @ 3. min, 5. K/min; Tend: 250. C |
Capillary | CP Sil 5 CB | 1089. | Rohloff and Bones, 2005 | 30. m/0.25 mm/0.25 μm, He, 40. C @ 1. min, 4. K/min; Tend: 220. C |
Capillary | CP Sil 5 CB | 1089. | Rohloff and Bones, 2005 | 30. m/0.25 mm/0.25 μm, He, 40. C @ 1. min, 4. K/min; Tend: 220. C |
Capillary | HP-5 | 1088. | Saeidnia, Gohari, et al., 2005 | He, 5. K/min; Column length: 30. m; Column diameter: 0.25 mm; Tstart: 60. C; Tend: 240. C |
Capillary | HP-5MS | 1087. | Sajjadi S.E. and Eskandari B., 2005 | 30. m/0.25 mm/0.25 μm, He, 4. K/min; Tstart: 60. C; Tend: 280. C |
Capillary | HP-5MS | 1087. | Sajjadi and Ghannadi, 2005 | 30. m/0.25 mm/0.25 μm, He, 4. K/min; Tstart: 60. C; Tend: 275. C |
Capillary | HP-5MS | 1085. | Sajjadi, 2005 | 30. m/0.25 mm/0.25 μm, He, 4. K/min; Tstart: 60. C; Tend: 280. C |
Capillary | DB-5 | 1086. | Salehi, Sefidkon, et al., 2005 | 30. m/0.25 mm/0.25 μm, He, 60. C @ 4. min, 3. K/min; Tend: 220. C |
Capillary | DB-1 | 1064. | Salehi, Sonboli, et al., 2005 | 60. m/0.25 mm/0.25 μm, He, 5. K/min, 250. C @ 10. min; Tstart: 60. C |
Capillary | DB-5 | 1087. | Sefidkon and Jamzad, 2005 | He, 4. K/min; Column length: 30. m; Column diameter: 0.25 mm; Tstart: 40. C; Tend: 240. C |
Capillary | HP-5MS | 1092. | Setzer, Noletto, et al., 2005 | 30. m/0.25 mm/0.25 μm, He, 60. C @ 5. min, 3. K/min; Tend: 280. C |
Capillary | PE-5 | 1078. | Singh, Raina, et al., 2005 | 30. m/0.32 mm/0.25 μm, H2, 60. C @ 2. min, 5. K/min, 230. C @ 4. min |
Capillary | DB-5 | 1089. | Skoula and Grayer, 2005 | 30. m/0.25 mm/0.25 μm, He, 3. K/min, 230. C @ 20. min; Tstart: 60. C |
Capillary | HP-5MS | 1089. | Slavkovska, Couladis, et al., 2005 | 30. m/0.25 mm/0.25 μm, He, 3. K/min; Tstart: 60. C; Tend: 280. C |
Capillary | RTX-1 | 1083. | Sonboli A., Fakhari A.R., et al., 2005 | 60. m/0.25 mm/0.25 μm, He, 5. K/min, 250. C @ 10. min; Tstart: 60. C |
Capillary | RTX-1 | 1082. | Sonboli, Salehi, et al., 2005 | 60. m/0.25 mm/0.25 μm, He, 5. K/min, 25. C @ 10. min; Tstart: 60. C |
Capillary | DB-1 | 1081. | Sonboli, Salehi, et al., 2005, 2 | 60. m/0.25 mm/0.25 μm, He, 5. K/min, 250. C @ 10. min; Tstart: 60. C |
Capillary | DB-5 | 1099. | Stevanovic, Garneau, et al., 2005 | 30. m/0.25 mm/0.25 μm, 40. C @ 2. min, 2. K/min, 210. C @ 33. min |
Capillary | HP-5MS | 1095. | Tepe B., Sokmen M., et al., 2005 | 30. m/0.25 mm/0.25 μm, He, 50. C @ 3. min, 3. K/min; Tend: 240. C |
Capillary | HP-5MS | 1052. | Tzakou, Bazos, et al., 2005 | 30. m/0.25 mm/0.25 μm, He, 3. K/min; Tstart: 60. C; Tend: 280. C |
Capillary | DB-5 | 1058. | Tzakou and Constantinidis, 2005 | 30. m/0.32 mm/0.25 μm, He, 3. K/min; Tstart: 60. C; Tend: 280. C |
Capillary | DB-1 | 1068. | Velasco-Negueruela, Pérez-Alonso, et al., 2005 | 50. m/0.25 mm/0.25 μm, N2, 4. K/min; Tstart: 90. C; Tend: 240. C |
Capillary | DB-1 | 1066. | Velasco-Negueruela, Pérez-Alonso, et al., 2005, 2 | 50. m/0.25 mm/0.25 μm, 3. K/min; Tstart: 60. C; Tend: 240. C |
Capillary | HP-5MS | 1083. | Vichi, Riu-Aumatell, et al., 2005 | 30. m/0.25 mm/0.25 μm, 40. C @ 5. min, 3. K/min, 220. C @ 10. min |
Capillary | SPB-1 | 1076. | Wong, Lee, et al., 2005 | 50. m/0.2 mm/0.33 μm, He, 50. C @ 3. min, 4. K/min, 220. C @ 30. min |
Capillary | BP-1 | 1078. | Blanc, Muselli, et al., 2004 | 50. m/0.22 mm/0.25 μm, 2. K/min, 220. C @ 20. min; Tstart: 60. C |
Capillary | SE-52 | 1079. | Cakir, Kordali, et al., 2004 | 25. m/0.32 mm/0.15 μm, N2, 45. C @ 5. min, 3. K/min, 200. C @ 30. min |
Capillary | SPB-5 | 1092. | Gauvin, Ravaomanarivo, et al., 2004 | 60. m/0.32 mm/1. μm, He, 4. K/min, 200. C @ 30. min; Tstart: 60. C |
Capillary | DB-1 | 1089. | bin Jantan, Ayop, et al., 2004 | 25. m/0.25 mm/0.25 μm, 60. C @ 10. min, 3. K/min, 180. C @ 10. min |
Capillary | DB-5 | 1088. | JAvidnia, Mojab, et al., 2004 | 25. m/0.25 mm/0.25 μm, Nitrogen, 3. K/min; Tstart: 60. C; Tend: 240. C |
Capillary | ZB-5 | 1099. | Jürgens and Dötterl, 2004 | 60. m/0.25 mm/0.25 μm, He, 40. C @ 4.6 min, 6. K/min, 260. C @ 1. min |
Capillary | DB-5 | 1086. | Kalvandi, Sefidkon, et al., 2004 | 60. m/0.25 mm/0.25 μm, He, 40. C @ 4. min, 4. K/min; Tend: 280. C |
Capillary | SE-54 | 1086. | Kilic, Hafizoglu, et al., 2004 | 30. m/0.25 mm/0.25 μm, He, 60. C @ 5. min, 2. K/min; Tend: 260. C |
Capillary | HP-5MS | 1088. | Li and Jiang, 2004 | 30. m/0.25 mm/0.25 μm, He, 50. C @ 2. min, 5. K/min, 230. C @ 10. min |
Capillary | RTX-1 | 1080. | Lis, Boczek, et al., 2004 | 30. m/0.32 mm/0.25 μm, N2, 4. K/min; Tstart: 60. C; Tend: 300. C |
Capillary | DB-5 | 1098. | Lopez Arze, Collin, et al., 2004 | 30. m/0.25 mm/0.25 μm, 40. C @ 2. min, 2. K/min, 210. C @ 33. min |
Capillary | DB-5MS | 1051. | Marongiu, Piras, et al., 2004 | 30. m/0.25 mm/0.25 μm, He, 3. K/min, 280. C @ 30. min; Tstart: 60. C |
Capillary | DB-5MS | 1050. | Marongiu, Porcedda, et al., 2004 | 30. m/0.25 mm/0.25 μm, He, 3. K/min, 280. C @ 30. min; Tstart: 60. C |
Capillary | NB-30 | 1080. | Orav, Stulova, et al., 2004 | 50. m/0.2 mm/0.25 μm, He, 2. K/min; Tstart: 50. C; Tend: 250. C |
Capillary | NB-30 | 1080. | Orav, Stulova, et al., 2004 | 50. m/0.2 mm/0.25 μm, He, 2. K/min; Tstart: 50. C; Tend: 250. C |
Capillary | DB-1 | 1082. | Palá-Paúl, García-Jiménez, et al., 2004 | 50. m/0.22 mm/0.25 μm, He, 4. K/min; Tstart: 70. C; Tend: 220. C |
Capillary | DB-1 | 1074. | Palá-Paúl, Velasco-Negueruela, et al., 2004 | 50. m/0.25 mm/0.25 μm, N2, 4. K/min; Tstart: 95. C; Tend: 240. C |
Capillary | NB-30 | 1080. | Raal, Arak, et al., 2004 | 50. m/0.2 mm/0.25 μm, He, 2. K/min; Tstart: 50. C; Tend: 250. C |
Capillary | NB-30 | 1080. | Raal, Paaver, et al., 2004 | 50. m/0.20 mm/0.25 μm, He, 2. K/min; Tstart: 50. C; Tend: 250. C |
Capillary | DB-5 | 1089. | Rohloff, Mordal, et al., 2004 | 30. m/0.25 mm/0.25 μm, He, 2.5 K/min, 220. C @ 6. min; Tstart: 35. C |
Capillary | Methyl Silicone | 1080. | Rojas, Usubillaga, et al., 2004 | 60. m/0.25 mm/0.25 μm, He, 60. C @ 1. min, 4. K/min, 200. C @ 20. min |
Capillary | HP-5 MS | 1080. | Royas, Usubillaga, et al., 2004 | 30. m/0.25 mm/0.25 μm, Helium, 60. C @ 1. min, 4. K/min, 200. C @ 20. min |
Capillary | HP-5MS | 1084. | Sadeghpour, Asghari, et al., 2004 | 30. m/0.25 mm/0.25 μm, He, 4. K/min; Tstart: 60. C; Tend: 280. C |
Capillary | HP-5MS | 1090. | Sajjadi and Shahpiri, 2004 | 30. m/0.25 mm/0.25 μm, He, 4. K/min; Tstart: 60. C; Tend: 280. C |
Capillary | DB-1 | 1086. | Sawamura, Son, et al., 2004 | 60. m/0.25 mm/0.25 μm, 70. C @ 2. min, 2. K/min, 230. C @ 20. min |
Capillary | DB-1 | 1086. | Sawamura, Sou, et al., 2004 | 60. m/0.25 mm/0.25 μm, Nitrogen, 70. C @ 2. min, 2. K/min; Tend: 230. C |
Capillary | DB-5 | 1088. | Sefidkon, Jamzad, et al., 2004 | 30. m/0.25 mm/0.25 μm, 50. C @ 5. min, 3. K/min; Tend: 250. C |
Capillary | HP-1 | 1061. | Senatore, Napolitano, et al., 2004 | 30. m/0.25 mm/0.33 μm, He, 40. C @ 5. min, 2. K/min, 260. C @ 20. min |
Capillary | DB-5 | 1079. | Suyenaga, Apel, et al., 2004 | 30. m/0.25 mm/0.25 μm, 3. K/min; Tstart: 60. C; Tend: 300. C |
Capillary | DB-5 | 1087. | Tellez, Khan, et al., 2004 | 30. m/0.25 mm/0.25 μm, He, 3. K/min; Tstart: 60. C; Tend: 240. C |
Capillary | CP Sil 5 CB | 1074. | Thappa, Bakshi, et al., 2004 | 20. m/0.25 mm/0.25 μm, He, 100. C @ 2. min, 8. K/min; Tend: 270. C |
Capillary | DB-5 | 1089. | Tirillini, Pellegrino, et al., 2004 | 30. m/0.25 mm/0.25 μm, He, 3. K/min; Tstart: 60. C; Tend: 300. C |
Capillary | BPX-5 | 1096. | Vilaseca, Guy, et al., 2004 | 25. m/0.22 mm/1. μm, He, 60. C @ 5. min, 3. K/min, 250. C @ 10. min |
Capillary | CP Sil 8 CB | 1086. | Wang and Guo-Y. -L., 2004 | 30. m/0.25 mm/0.25 μm, He, 50. C @ 3. min, 10. K/min, 200. C @ 2. min |
Capillary | CP Sil 8 CB | 1088. | Wang, Guo, et al., 2004 | 30. m/0.32 mm/0.25 μm, 50. C @ 5. min, 5. K/min; Tend: 200. C |
Capillary | DB-5 | 1086. | Woerdenbag, Windono, et al., 2004 | 30. m/0.249 mm/0.25 μm, He, 3. K/min; Tstart: 60. C; Tend: 300. C |
Capillary | HP-5MS | 1088. | Afsharypuor and Jahromy, 2003 | 30. m/0.25 mm/0.25 μm, He, 4. K/min; Tstart: 60. C; Tend: 275. C |
Capillary | HP-5 | 1082. | Bertoli, Menichini, et al., 2003 | 30. m/0.25 mm/0.25 μm, N2, 60. C @ 10. min, 5. K/min; Tend: 220. C |
Capillary | DB-1 | 1086. | Choi, 2003, 2 | 60. m/0.25 mm/0.25 μm, He, 70. C @ 2. min, 2. K/min, 230. C @ 20. min |
Capillary | HP-5MS | 1086. | Couladis, Özcan, et al., 2003 | 30. m/0.25 mm/0.25 μm, He, 3. K/min; Tstart: 60. C; Tend: 280. C |
Capillary | RTX-5Sil | 1086. | Dudai, Larkov, et al., 2003 | 30. m/0.25 mm/0.25 μm, He, 4. K/min, 200. C @ 10. min; Tstart: 70. C |
Capillary | DB-5 | 1090. | Edris and Farrag, 2003 | He, 3. K/min; Column length: 60. m; Column diameter: 0.32 mm; Tstart: 50. C; Tend: 220. C |
Capillary | DB-5 | 1090. | Edris and Farrag, 2003 | He, 3. K/min; Column length: 60. m; Column diameter: 0.32 mm; Tstart: 50. C; Tend: 220. C |
Capillary | DB-5 | 1090. | Edris, Shalaby, et al., 2003 | He, 3. K/min; Column length: 60. m; Column diameter: 0.32 mm; Tstart: 50. C; Tend: 200. C |
Capillary | HP-5MS | 1094. | Feizbaksh, Saber Tehrani, et al., 2003 | 30. m/0.25 mm/0.25 μm, He, 60. C @ 20. min, 5. K/min, 220. C @ 20. min |
Capillary | HP-1 | 1079. | Fekam Boyom, Amvam Zollo, et al., 2003 | 30. m/0.25 mm/0.25 μm, He, 10. K/min; Tstart: 70. C; Tend: 200. C |
Capillary | DB-1 | 1068. | Fekam Boyom, Ngouana, et al., 2003 | 30. m/0.25 mm/0.25 μm, N2, 5. K/min; Tstart: 50. C; Tend: 200. C |
Capillary | HP-5MS | 1088. | Ghasemi, Asghari, et al., 2003 | 30. m/0.25 mm/0.25 μm, He, 4. K/min; Tstart: 60. C; Tend: 280. C |
Capillary | HP-5 | 1086. | Ghannadi and Zolfaghari, 2003 | 30. m/0.25 mm/0.25 μm, He, 4. K/min; Tstart: 60. C; Tend: 275. C |
Capillary | HP-5MS | 1087. | Hajhashemi, Ghannadi, et al., 2003 | 30. m/0.25 mm/0.25 μm, He, 4. K/min; Tstart: 60. C; Tend: 275. C |
Capillary | RSL-200 | 1079. | Jirovetz, Buchbauer, et al., 2003 | 30. m/0.32 mm/0.25 μm, H2, 40. C @ 5. min, 6. K/min, 280. C @ 5. min |
Capillary | RSL-200 | 1084. | Jirovetz, Buchbauer, et al., 2003, 2 | 30. m/0.32 mm/0.25 μm, H2, 40. C @ 5. min, 6. K/min, 280. C @ 5. min |
Capillary | SE-30 | 1076. | Kambouche and El-Abed, 2003 | 12. m/0.22 mm/0.3 μm, He, 3. K/min; Tstart: 70. C; Tend: 220. C |
Capillary | CP Sil 5 CB | 1077. | Kanjilal, Kotoky, et al., 2003 | 25. m/0.25 mm/0.25 μm, He, 35. C @ 2.5 min, 5. K/min; Tend: 280. C |
Capillary | DB-5MS | 1087. | Maia, Taveira, et al., 2003 | 30. m/0.25 mm/0.25 μm, He, 3. K/min; Tstart: 60. C; Tend: 240. C |
Capillary | DB-5 | 1070. | Marongiu, Porcedda, et al., 2003 | 30. m/0.25 mm/0.25 μm, He, 3. K/min, 280. C @ 30. min; Tstart: 60. C |
Capillary | DB-5 | 1088. | Masotti, Juteau, et al., 2003 | 50. m/0.2 mm/0.25 μm, He, 50. C @ 2. min, 3. K/min; Tend: 220. C |
Capillary | ZB-1 | 1072. | Mierendorff, Stahl-Biskup, et al., 2003 | 30. m/0.25 mm/0.25 μm, N2, 3. K/min; Tstart: 45. C; Tend: 230. C |
Capillary | DB-1 | 1087. | Mirza, Nik, et al., 2003 | 60. m/0.25 mm/0.25 μm, He, 4. K/min; Tstart: 50. C; Tend: 270. C |
Capillary | HP-5 | 1086. | Mookdasanit, Tamura, et al., 2003 | Helium, 2. K/min, 210. C @ 60. min; Column length: 30. m; Column diameter: 0.32 mm; Tstart: 70. C |
Capillary | OV-101 | 1077. | Orav, Kailas, et al., 2003 | 50. m/0.2 mm/0.5 μm, He, 2. K/min; Tstart: 50. C; Tend: 250. C |
Capillary | CP Sil 5 CB | 1081. | Oyedeji, Ekundayo, et al., 2003 | 25. m/0.25 mm/0.15 μm, H2, 3. K/min; Tstart: 50. C; Tend: 230. C |
Capillary | DB-1 | 1081. | Perez-Alonso, Velasco-Negueruela, et al., 2003 | 50. m/0.25 mm/0.25 μm, N2, 4. K/min; Tstart: 95. C; Tend: 240. C |
Capillary | DB-5 | 1088. | Pino, Marbot, et al., 2003, 2 | 30. m/0.25 mm/0.25 μm, H2, 60. C @ 10. min, 4. K/min, 280. C @ 40. min |
Capillary | HP-5 | 1072. | Pitarokili, Tzakou, et al., 2003 | 30. m/0.25 mm/0.25 μm, He, 3. K/min; Tstart: 60. C; Tend: 280. C |
Capillary | DB-1 | 1076. | Pourmortazavi, Sefidkon, et al., 2003 | 60. m/0.25 mm/0.25 μm, He, 4. K/min; Tstart: 50. C; Tend: 250. C |
Capillary | DB-5 | 1082. | Rotman, Ahumada, et al., 2003 | 30. m/0.25 mm/0.25 μm, N2, 2. K/min; Tstart: 40. C; Tend: 230. C |
Capillary | HP-5 | 1089. | Sajjadi and Mehregan, 2003 | 30. m/0.25 mm/0.25 μm, He, 4. K/min; Tstart: 60. C; Tend: 280. C |
Capillary | DB-1 | 1084. | Shahmir, Ahmadi, et al., 2003 | 60. m/0.25 mm/0.25 μm, He, 4. K/min; Tstart: 50. C; Tend: 280. C |
Capillary | DB-5 | 1087. | da Silva, Luz, et al., 2003 | 30. m/0.25 mm/0.25 μm, He, 3. K/min; Tstart: 60. C; Tend: 240. C |
Capillary | HP-5 | 1088. | Stashenko, Jaramillo, et al., 2003 | 60. m/0.25 mm/0.25 μm, 40. C @ 15. min, 5. K/min; Tend: 250. C |
Capillary | DB-1 | 1069. | Velasco-Negueruela, Pérez-Alonso, et al., 2003 | 50. m/0.25 mm/0.25 μm, N2, 4. K/min; Tstart: 90. C; Tend: 240. C |
Capillary | Cross-Linked Methylsilicone | 1068. | Velasco-Negueruela, Pérez-Alonso, et al., 2003, 2 | 25. m/0.2 mm/0.33 μm, He, 4. K/min; Tstart: 70. C; Tend: 250. C |
Capillary | HP-5 | 1088. | Velickovic, Randjelovic, et al., 2003 | 25. m/0.32 mm/0.53 μm, H2, 4. K/min; Tstart: 40. C; Tend: 280. C |
Capillary | HP-5 | 1089. | Velickovic, Randjelovic, et al., 2003 | 25. m/0.32 mm/0.53 μm, H2, 4. K/min; Tstart: 40. C; Tend: 280. C |
Capillary | HP-5 | 1084. | Velickovic, Ristic, et al., 2003 | 25. m/0.32 mm/0.53 μm, Helium, 4. K/min; Tstart: 40. C; Tend: 280. C |
Capillary | HP-5 | 1089. | Velickovic, Ristic, et al., 2003 | 25. m/0.32 mm/0.53 μm, Helium, 4. K/min; Tstart: 40. C; Tend: 280. C |
Capillary | HP-5 | 1097. | Yassa, Akhani, et al., 2003 | 30. m/0.25 mm/0.32 μm, He, 60. C @ 30. min, 5. K/min; Tend: 250. C |
Capillary | DB-5 | 1085. | Zoghbi, Andrade, et al., 2003 | 30. m/0.25 mm/0.25 μm, He, 3. K/min; Tstart: 60. C; Tend: 240. C |
Capillary | DB-5 | 1089. | Zrira, Elamrani, et al., 2003 | 25. m/0.25 mm/0.25 μm, N2, 4. K/min, 250. C @ 10. min; Tstart: 50. C |
Capillary | DB-5 | 1087. | Bos, Koulman, et al., 2002 | 30. m/0.249 mm/0.25 μm, He, 3. K/min, 300. C @ 5. min; Tstart: 60. C |
Capillary | DB-5 | 1070. | Caredda, Marongiu, et al., 2002 | 30. m/0.25 mm/0.25 μm, He, 3. K/min, 280. C @ 30. min; Tstart: 60. C |
Capillary | HP-1 | 1077. | Cavaleiro, Salgueiro, et al., 2002, 2 | 30. m/0.25 mm/0.25 μm, He, 3. K/min, 220. C @ 15. min; Tstart: 70. C |
Capillary | 5 % Phenyl methyl siloxane | 1089. | Cicció and Gómez-Laurito, 2002 | 30. m/0.25 mm/0.25 μm, He, 75. C @ 4. min, 3. K/min, 200. C @ 8. min |
Capillary | DB-5MS | 1079. | Congiu, Falconieri, et al., 2002 | 30. m/0.25 mm/0.25 μm, He, 3. K/min; Tstart: 60. C; Tend: 280. C |
Capillary | HP-5 | 1089. | Farah, Fechtal. M., et al., 2002 | 30. m/0.25 mm/0.25 μm, N2, 50. C @ 5. min, 4. K/min; Tend: 250. C |
Capillary | DB-5 | 1089. | Flamini, Ertugrul, et al., 2002 | 30. m/0.25 mm/0.25 μm, He, 3. K/min; Tstart: 60. C; Tend: 240. C |
Capillary | DB-1 | 1067. | Gancel, Ollé, et al., 2002 | 30. m/0.32 mm/0.25 μm, H2, 40. C @ 20. min, 3. K/min; Tend: 245. C |
Capillary | PTE-5 | 1088. | Gudzic, Djokovic, et al., 2002 | 60. m/0.32 mm/0.30 μm, H2, 4.3 K/min; Tstart: 60. C; Tend: 285. C |
Capillary | SE-30 | 1086. | Iñigo, Palá-Paúl, et al., 2002 | 50. m/0.25 mm/0.25 μm, He, 4. K/min; Tstart: 70. C; Tend: 240. C |
Capillary | RSL-200 | 1078. | Jirovetz, Buchbauer, et al., 2002 | 30. m/0.32 mm/0.25 μm, H2, 40. C @ 5. min, 6. K/min, 280. C @ 5. min |
Capillary | RSL-200 | 1074. | Jirovetz, Ngassoum, et al., 2002 | 30. m/0.32 mm/0.25 μm, H2, 50. C @ 5. min, 6. K/min, 280. C @ 5. min |
Capillary | CP Sil 8 CB | 1087. | Juteau, Masotti, et al., 2002 | 30. m/0.25 mm/0.25 μm, He, 50. C @ 2. min, 3. K/min; Tend: 220. C |
Capillary | DB-1 | 1089. | Khallouki, Younos, et al., 2002 | 25. m/0.23 mm/0.20 μm, He, 50. C @ 3. min, 3. K/min, 200. C @ 30. min |
Capillary | DB-5 | 1090. | Kobaisy, Tellez, et al., 2002 | 30. m/0.25 mm/0.25 μm, He, 3. K/min; Tstart: 60. C; Tend: 240. C |
Capillary | DB-5 | 1089. | Krauze-Baranowska, Mardarowicz, et al., 2002 | 30. m/0.25 mm/0.25 μm, He, 35. C @ 2. min, 3. K/min, 280. C @ 15. min |
Capillary | DB-5 | 1090. | Krauze-Baranowska, Mardarowicz, et al., 2002, 2 | 30. m/0.25 mm/0.25 μm, He, 35. C @ 2. min, 4. K/min, 280. C @ 15. min |
Capillary | OV-101 | 1082. | Kuiate, Bessière, et al., 2002 | He, 5. K/min; Column length: 25. m; Column diameter: 0.32 mm; Tstart: 50. C; Tend: 200. C |
Capillary | DB-5 | 1086. | Maia, da Silva, et al., 2002 | 30. m/0.25 mm/0.25 μm, He, 3. K/min; Tstart: 60. C; Tend: 240. C |
Capillary | DB-5MS | 1089. | Maia, Zoghbi, et al., 2002 | 30. m/0.25 mm/0.25 μm, He, 3. K/min; Tstart: 60. C; Tend: 240. C |
Capillary | OV-101 | 1080. | Menut, Bessière, et al., 2002 | He, 5. K/min; Column length: 25. m; Column diameter: 0.32 mm; Tstart: 50. C; Tend: 200. C |
Capillary | CP Sil 5 CB | 1080. | Mojab, Rustaiyan, et al., 2002 | 25. m/0.25 mm/0.39 μm, He, 5. K/min; Tstart: 60. C; Tend: 220. C |
Capillary | HP-5 | 1091. | Novak, Langbehn, et al., 2002 | 30. m/0.25 mm/0.25 μm, 3. K/min; Tstart: 60. C; Tend: 240. C |
Capillary | OV-101 | 1078. | Orav, Kailas, et al., 2002 | 50. m/0.2 mm/0.5 μm, He, 2. K/min; Tstart: 50. C; Tend: 250. C |
Capillary | ZEBRON-5 | 1053. | Öztürk, Akay, et al., 2002 | 6. m/0.25 mm/0.25 μm, He, 40. C @ 5. min, 3. K/min, 200. C @ 15. min |
Capillary | DB-1 | 1068. | Palá-Paúl, Pérez-Alonso, et al., 2002 | 50. m/0.25 mm/0.25 μm, N2, 4. K/min; Tstart: 80. C; Tend: 225. C |
Capillary | SPB-5 | 1088. | Pino, Marbot, et al., 2002, 5 | 30. m/0.25 mm/0.25 μm, Helium, 60. C @ 2. min, 4. K/min, 250. C @ 20. min |
Capillary | DB-1 | 1077. | Sefidkon, 2002 | 60. m/0.25 mm/0.25 μm, He, 40. C @ 5. min, 4. K/min; Tend: 280. C |
Capillary | DB-1 | 1068. | Velasco-Negueruela, Pérez-Alonso, et al., 2002 | 50. m/0.25 mm/0.25 μm, N2, 4. K/min; Tstart: 95. C; Tend: 240. C |
Capillary | DB-1 | 1066. | Velasco-Negueruela, Pérez-Alonso, et al., 2002, 2 | 50. m/0.25 mm/0.25 μm, N2, 3. K/min; Tstart: 60. C; Tend: 240. C |
Capillary | HP-5 | 1088. | Velickovic, Randjelovic, et al., 2002 | 30. m/0.25 mm/0.25 μm, H2, 4. K/min; Tstart: 40. C; Tend: 280. C |
Capillary | DB-1 | 1077. | Yamini, Sefidkon, et al., 2002 | 60. m/0.25 mm/0.25 μm, He, 50. C @ 5. min, 4. K/min; Tend: 250. C |
Capillary | DB-5MS | 1088. | Zoghbi, Andrade, et al., 2002 | 30. m/0.25 mm/0.25 μm, He, 3. K/min; Tstart: 60. C; Tend: 270. C |
Capillary | DB-5 | 1089. | Zoghbi, Andrade, et al., 2002, 2 | 30. m/0.25 mm/0.25 μm, He, 3. K/min; Tstart: 60. C; Tend: 240. C |
Capillary | DB-5MS | 1075. | Cherchi, Deidda, et al., 2001 | 30. m/0.25 mm/0.25 μm, He, 3. K/min; Tstart: 60. C; Tend: 240. C |
Capillary | SPB-5 | 1089. | Cornu, Carnat, et al., 2001 | He, 40. C @ 5. min, 3. K/min, 220. C @ 15. min; Column length: 60. m; Column diameter: 0.32 mm |
Capillary | DB-1 | 1070. | Dabiri and Sefidkon, 2001 | 60. m/0.25 mm/0.25 μm, He, 40. C @ 5. min, 4. K/min; Tend: 280. C |
Capillary | DB-1 | 1078. | Dabiri and Sefidkon, 2001 | 60. m/0.25 mm/0.25 μm, He, 40. C @ 5. min, 4. K/min; Tend: 280. C |
Capillary | HP-5 | 1089. | Flamini, Cioni, et al., 2001 | 30. m/0.25 mm/0.25 μm, N2, 60. C @ 10. min, 5. K/min; Tend: 220. C |
Capillary | OV-1 | 1076. | Gallori, Bilia, et al., 2001 | 30. m/0.32 mm/0.3 μm, H2, 50. C @ 1. min, 3. K/min, 250. C @ 20. min |
Capillary | HP-5 | 1089. | Gallori, Flamini, et al., 2001 | 30. m/0.25 mm/0.25 μm, N2, 60. C @ 10. min, 5. K/min; Tend: 220. C |
Capillary | RSL-200 | 1079. | Jirovetz L., Buchbauer G., et al., 2001 | 30. m/0.32 mm/0.25 μm, H2, 40. C @ 5. min, 6. K/min, 280. C @ 5. min |
Capillary | RTX-1 | 1083. | Kalemba, Marschall, et al., 2001 | 30. m/0.25 mm/0.25 μm, N2, 4. K/min; Tstart: 60. C; Tend: 300. C |
Capillary | SPB-5 | 1097. | Kim and Lee, 2001 | 60. m/0.25 mm/0.25 μm, Helium, 50. C @ 3. min, 3. K/min, 240. C @ 10. min |
Capillary | BP-1 | 1078. | Lota, de Rocca Serra, et al., 2001 | 50. m/0.22 mm/0.25 μm, He, 2. K/min, 230. C @ 35. min; Tstart: 60. C |
Capillary | CBP-1 | 1076. | Ly, Yamauchi, et al., 2001 | 25. m/0.25 mm/0.25 μm, Nitrogen, 50. C @ 2. min, 3. K/min; Tend: 210. C |
Capillary | DB-5MS | 1088. | Marongiu, Porcedda, et al., 2001 | 30. m/0.25 mm/0.25 μm, He, 3. K/min, 240. C @ 30. min; Tstart: 60. C |
Capillary | DB-1 | 1076. | Mirza, Ahmadi, et al., 2001 | 60. m/0.25 mm/0.25 μm, He, 4. K/min; Tstart: 50. C; Tend: 270. C |
Capillary | RSL-200 | 1077. | Ngassoum, Jirovetz, et al., 2001 | 30. m/0.32 mm/0.25 μm, H2, 40. C @ 5. min, 6. K/min, 280. C @ 5. min |
Capillary | OV-101 | 1073. | Orav, Kailas, et al., 2001 | 50. m/0.2 mm/0.5 μm, He, 2. K/min; Tstart: 50. C; Tend: 250. C |
Capillary | OV-101 | 1076. | Orav and Kann, 2001 | He, 2. K/min; Column length: 50. m; Column diameter: 0.2 mm; Tstart: 50. C; Tend: 250. C |
Capillary | OV-101 | 1076. | Orav and Kann, 2001 | He, 2. K/min; Column length: 50. m; Column diameter: 0.2 mm; Tstart: 50. C; Tend: 250. C |
Capillary | DB-1 | 1045. | Palá-Paúl, Pérez-Alonso, et al., 2001 | 30. m/0.25 mm/0.25 μm, N2, 4. K/min; Tstart: 80. C; Tend: 225. C |
Capillary | DB-5 | 1090. | Rousis, Papadogianni, et al., 2001 | He, 50. C @ 5. min, 3. K/min; Column length: 60. m; Column diameter: 0.25 mm; Tend: 250. C |
Capillary | DB-5 | 1086. | Santos-Gomes and Fernandes-Ferreira, 2001 | 30. m/0.25 mm/0.25 μm, H2, 3. K/min; Tstart: 60. C; Tend: 285. C |
Capillary | DB-5 | 1089. | Tellez M., Estell R., et al., 2001 | 30. m/0.25 mm/0.25 μm, He, 3. K/min; Tstart: 60. C; Tend: 240. C |
Capillary | SPB-1 | 1083. | Vijayanand, Rao, et al., 2001 | 30. m/0.32 mm/0.25 μm, He, 2. K/min; Tstart: 50. C; Tend: 250. C |
Capillary | OV-101 | 1082. | Yang, 2001 | N2, 2. K/min; Column length: 50. m; Column diameter: 0.25 mm; Tstart: 80. C; Tend: 200. C |
Capillary | OV-101 | 1082. | Yang, 2001, 2 | N2, 2. K/min; Column length: 50. m; Column diameter: 0.25 mm; Tstart: 80. C; Tend: 200. C |
Capillary | CP Sil 5 CB | 1078. | Asekun and Ekundayo, 2000 | 25. m/0.25 mm/0.15 μm, 3. K/min; Tstart: 50. C; Tend: 230. C |
Capillary | CP Sil 5 CB | 1074. | Baser, Özek, et al., 2000 | 25. m/0.25 mm/0.4 μm, He, 60. C @ 40. min, 5. K/min; Tend: 260. C |
Capillary | RSL-200 | 1077. | Jirovetz, Puschmann, et al., 2000 | 60. m/0.32 mm/0.25 μm, H2, 6. K/min; Tstart: 40. C; Tend: 250. C |
Capillary | DB-1 | 1081. | Mallavarapu, Rao, et al., 2000 | 25. m/0.50 mm/0.25 μm, Nitrogen, 5. K/min; Tstart: 60. C; Tend: 220. C |
Capillary | DB-5 | 1092. | Mitiku, Sawamura, et al., 2000 | 30. m/0.22 mm/0.25 μm, N2, 70. C @ 2. min, 4. K/min, 230. C @ 20. min |
Capillary | BP-1 | 1087. | Mohagheghzadeh, Shams-Ardakani, et al., 2000 | 25. m/0.33 mm/1.0 μm, N2, 4. K/min; Tstart: 60. C; Tend: 275. C |
Capillary | HP-5 | 1087. | Mohagheghzadeh, Shams-Ardakani, et al., 2000, 2 | 30. m/0.25 mm/0.25 μm, He, 4. K/min; Tstart: 60. C; Tend: 275. C |
Capillary | DB-1 | 1077. | Senatore, Napolitano, et al., 2000 | 30. m/0.25 mm/0.25 μm, He, 40. C @ 5. min, 2. K/min, 260. C @ 2. min |
Capillary | OV-101 | 1082. | Tamura, Boonbumrung, et al., 2000 | Nitrogen, 40. C @ 10. min, 2. K/min; Column length: 50. m; Column diameter: 0.25 mm; Tend: 200. C |
Capillary | DB-5 | 1090. | Tellez, Dayan, et al., 2000 | 30. m/0.25 mm/0.25 μm, He, 3. K/min; Tstart: 60. C; Tend: 240. C |
Capillary | Methyl Silicone | 1080.40 | Baraldi, Rapparini, et al., 1999 | 60. m/0.25 mm/0.25 μm, 40. C @ 10. min, 5. K/min; Tend: 220. C |
Capillary | SPB-1 | 1080. | Choo, Wong, et al., 1999 | 50. m/0.2 mm/0.33 μm, 4. K/min; Tstart: 60. C; Tend: 260. C |
Capillary | SE-30 | 1075. | Jassbi, Ahmad, et al., 1999 | 30. m/0.25 mm/0.25 μm, N2, 60. C @ 10. min, 4. K/min; Tend: 220. C |
Capillary | RTX-1 | 1082. | Kalemba, 1999 | 30. m/0.25 mm/0.25 μm, N2, 4. K/min; Tstart: 60. C; Tend: 300. C |
Capillary | DB-1 | 1087. | Koulman, 1999 | 25. m/0.25 mm/0.25 μm, He, 4. K/min; Tstart: 50. C; Tend: 290. C |
Capillary | OV-101 | 1082. | Kuiate, Zollo, et al., 1999 | 5. K/min; Column length: 25. m; Column diameter: 0.32 mm; Tstart: 50. C; Tend: 200. C |
Capillary | CBP-1 | 1082. | Labuckas, Zygadlo, et al., 1999 | He, 4. K/min; Column length: 25. m; Column diameter: 0.3 mm; Tstart: 60. C; Tend: 240. C |
Capillary | DB-5 | 1090. | Meynier, Novelli, et al., 1999 | 30. m/0.32 mm/1. μm, 40. C @ 5. min, 3. K/min; Tend: 200. C |
Capillary | OV-1 | 1075. | Oberhofer, Nikiforov, et al., 1999 | 25. m/0.25 mm/0.25 μm, H2, 40. C @ 5. min, 3. K/min, 220. C @ 5. min |
Capillary | OV-1 | 1080. | Orav, Kailas, et al., 1999 | 2. K/min; Tstart: 50. C; Tend: 160. C |
Capillary | OV-101 | 1075. | Orav, Kailas, et al., 1999, 2 | 50. m/0.20 mm/0.50 μm, Helium, 30. C @ 6. min, 1. K/min; Tend: 100. C |
Capillary | CP Sil 5 CB | 1077. | Oyedeji, Olawore, et al., 1999 | He, 3. K/min; Column length: 25. m; Column diameter: 0.25 mm; Tstart: 50. C; Tend: 230. C |
Capillary | OV-101 | 1079. | Pateira, Nogueira, et al., 1999 | 50. m/0.25 mm/0.25 μm, He, 70. C @ 5. min, 2. K/min; Tend: 220. C |
Capillary | SE-30 | 1080. | Prikhod'ko, Klyuev, et al., 1999 | 30. m/0.25 mm/0.20 μm, Helium, 60. C @ 4. min, 3. K/min; Tend: 200. C |
Capillary | BP-1 | 1081. | Rao, Bhattacharya, et al., 1999 | N2, 5. K/min, 220. C @ 10. min; Column length: 25. m; Column diameter: 0.5 mm; Tstart: 60. C |
Capillary | CP Sil 5 CB | 1083. | Rustaiyan, Masoudi, et al., 1999 | 25. m/0.25 mm/0.39 μm, He, 60. C @ 5. min, 5. K/min, 220. C @ 20. min |
Capillary | DB-1 | 1080. | Sefidkon, Dabiri, et al., 1999 | 60. m/0.25 mm/0.25 μm, He, 40. C @ 5. min, 4. K/min; Tend: 280. C |
Capillary | DB-5 | 1087. | Sefidkon and Khajavi, 1999 | 30. m/0.25 mm/0.25 μm, He, 40. C @ 5. min, 4. K/min; Tend: 220. C |
Capillary | DB-1 | 1087. | Sefidkon and Mirza, 1999 | 60. m/0.25 mm/0.25 μm, He, 4. K/min; Tstart: 50. C; Tend: 220. C |
Capillary | DB-5 | 1090. | Tellez, Canel, et al., 1999 | 30. m/0.25 mm/0.25 μm, He, 3. K/min; Tstart: 60. C; Tend: 240. C |
Capillary | OV-101 | 1083. | Tropnikova, Zenkevich, et al., 1999 | Nitrogen, 60. C @ 0. min, 4. K/min, 220. C @ 0. min; Column length: 25. m; Column diameter: 0.20 mm |
Capillary | SPB-5 | 1097. | Viallon C., Verdier-Metz I., et al., 1999 | 60. m/0.32 mm/1. μm, He, 40. C @ 5. min, 3. K/min, 200. C @ 2. min |
Capillary | OV-101 | 1079. | Zenkevich, Kosman, et al., 1999 | He, 6. K/min; Column length: 25. m; Column diameter: 0.20 mm; Tstart: 80. C; Tend: 240. C |
Capillary | DB-5MS | 1085. | Zoghbi, Andrade, et al., 1999 | 30. m/0.25 mm/0.25 μm, He, 3. K/min; Tstart: 60. C; Tend: 240. C |
Capillary | SPB-5 | 1090. | Doneanu and Anitescu, 1998 | 50. m/0.32 mm/0.25 μm, He, 3. K/min, 240. C @ 20. min; Tstart: 60. C |
Capillary | DB-5 | 1082. | El-Sakhawy, El-Tantawy, et al., 1998 | 30. m/0.25 mm/0.25 μm, He, 3. K/min; Tstart: 60. C; Tend: 240. C |
Capillary | SE-30 | 1081. | Jantan, Ahmad, et al., 1998 | He, 60. C @ 10. min, 3. K/min; Column length: 25. m; Column diameter: 0.2 mm; Tend: 180. C |
Capillary | DB-5 | 1087. | Maia, Zohhbi, et al., 1998 | 30. m/0.25 mm/0.25 μm, He, 3. K/min; Tstart: 60. C; Tend: 240. C |
Capillary | HP-101 | 1081. | Milso, Mastelic, et al., 1998 | 25. m/0.2 mm/0.2 μm, He, 70. C @ 2. min, 3. K/min, 200. C @ 10. min |
Capillary | HP-1 | 1077. | Ong and Acree, 1998 | 4. K/min; Column length: 25. m; Column diameter: 0.32 mm; Tstart: 35. C; Tend: 250. C |
Capillary | HP-5 | 1088. | Poiana, Sicari, et al., 1998 | 25. m/0.2 mm/0.33 μm, He, 70. C @ 8. min, 3. K/min, 290. C @ 20. min |
Capillary | HP-1 | 1077. | Stashenko, Cervantes, et al., 1998 | 60. m/0.25 mm/0.25 μm, He, 50. C @ 5. min, 4. K/min; Tend: 280. C |
Capillary | OV-101 | 1082. | Zollo, Biyiti, et al., 1998 | 5. K/min; Column length: 25. m; Column diameter: 0.32 mm; Tstart: 50. C; Tend: 200. C |
Capillary | CP Sil 5 CB | 1075. | Bos, Woerdenbag, et al., 1997 | 25. m/0.32 mm/0.25 μm, N2, 4. K/min; Tstart: 50. C; Tend: 290. C |
Capillary | CP Sil 5 CB | 1075. | Bos, Woerdenbag, et al., 1997, 2 | 25. m/0.25 mm/0.25 μm, He, 6. K/min; Tstart: 60. C; Tend: 300. C |
Capillary | SPB-Sulfur | 1095. | Mariaca, Berger, et al., 1997 | 30. m/0.32 mm/4. μm, He, 45. C @ 13. min, 5. K/min, 240. C @ 5. min |
Capillary | SPB-Sulfur | 1096. | Mariaca, Berger, et al., 1997 | 30. m/0.32 mm/4. μm, He, 45. C @ 13. min, 5. K/min, 240. C @ 5. min |
Capillary | DB-5 | 1059. | Reverchon, Porta, et al., 1997 | 30. m/0.25 mm/0.25 μm, He, 50. C @ 5. min, 2. K/min; Tend: 250. C |
Capillary | DB-1 | 1064. | Salgueiro, Vila, et al., 1997 | 6. K/min; Tstart: 80. C; Tend: 220. C |
Capillary | DB-5 | 1089. | Tellez, Estell, et al., 1997, 2 | 30. m/0.25 mm/0.25 μm, Helium, 3. K/min; Tstart: 60. C; Tend: 240. C |
Capillary | CBP-1 | 1072. | Zygadlo, Ariza-Espinar, et al., 1997 | He, 5. K/min; Column length: 25. m; Column diameter: 0.22 mm; Tstart: 60. C; Tend: 240. C |
Capillary | HP-1 | 1077. | Ayedoun, Adeoti, et al., 1996 | 23. m/0.32 mm/0.17 μm, He, 60. C @ 3. min, 5. K/min, 250. C @ 30. min |
Capillary | OV-101 | 1069. | Chacko, Jayalekshmy, et al., 1996 | 50. m/0.25 mm/0.17 μm, N2, 5. K/min; Tstart: 50. C; Tend: 220. C |
Capillary | OV-101 | 1077. | Orav, Kailas, et al., 1996 | He, 2. K/min; Column length: 50. m; Column diameter: 0.25 mm; Tstart: 50. C; Tend: 250. C |
Capillary | BP-1 | 1081. | Rajeswara, Kaul, et al., 1996 | N2, 5. K/min; Column length: 25. m; Column diameter: 0.50 mm; Tstart: 60. C; Tend: 220. C |
Capillary | BP-1 | 1082. | Rajeswara, Kaul, et al., 1996 | N2, 5. K/min; Column length: 25. m; Column diameter: 0.50 mm; Tstart: 60. C; Tend: 220. C |
Capillary | BP-1 | 1083. | Rajeswara, Kaul, et al., 1996 | N2, 5. K/min; Column length: 25. m; Column diameter: 0.50 mm; Tstart: 60. C; Tend: 220. C |
Capillary | DB-1 | 1072. | Sagrero-Nieves and Bartley, 1996 | 60. m/0.32 mm/0.50 μm, He, 50. C @ 1. min, 8. K/min, 250. C @ 6. min |
Capillary | HP-1 | 1077. | Thanh, Dung, et al., 1996 | 25. m/0.32 mm/0.25 μm, Helium, 60. C @ 2. min, 4. K/min, 220. C @ 20. min |
Capillary | SPB-1 | 1084. | Wong and Lai, 1996 | 50. m/0.2 mm/0.33 μm, He, 40. C @ 3. min, 3. K/min, 200. C @ 30. min |
Capillary | OV-101 | 1076. | Orav, Kuningas, et al., 1995 | 50. m/0.2 mm/0.5 μm, He, 1. K/min; Tstart: 70. C; Tend: 180. C |
Capillary | DB-1 | 1080. | Tirado, Stashenko, et al., 1995 | 60. m/0.25 mm/0.25 μm, He, 70. C @ 5. min, 2.5 K/min; Tend: 270. C |
Capillary | DB-1 | 1080. | Tirado, Stashenko, et al., 1995 | 60. m/0.25 mm/0.25 μm, He, 70. C @ 5. min, 2.5 K/min; Tend: 270. C |
Capillary | OV-1 | 1081. | Ramanoelina, Viano, et al., 1994 | 50. m/0.27 mm/0.2 μm, N2, 3. K/min; Tstart: 80. C; Tend: 240. C |
Capillary | HP-5 | 1098. | Collin, Deslauriers, et al., 1993 | 2. K/min; Tstart: 40. C; Tend: 210. C |
Capillary | HP-101 | 1076. | Demarne and van der Walt, 1993 | 50. m/0.32 mm/0.3 μm, H2, 65. C @ 5. min, 2. K/min; Tend: 300. C |
Capillary | Methyl Silicone | 1074. | Gopalakrishnan, Menon, et al., 1993 | 50. m/0.25 mm/0.17 μm, N2, 2. K/min; Tstart: 80. C; Tend: 200. C |
Capillary | Methyl Silicone | 1066. | Gopalakrishnan, Menon, et al., 1993 | 50. m/0.25 mm/0.17 μm, N2, 3. K/min; Tstart: 80. C; Tend: 200. C |
Capillary | CP Sil 5 CB | 1082. | Kaul, Singh, et al., 1993 | 5. K/min; Column length: 25. m; Column diameter: 0.25 mm; Tstart: 60. C; Tend: 280. C |
Capillary | Methyl Silicone | 1080. | Mallavarapu, Ramesh, et al., 1993 | 5. K/min; Column length: 25. m; Column diameter: 0.50 mm; Tstart: 60. C; Tend: 220. C |
Capillary | SE-54 | 1087. | Kollmannsberger, Nitz, et al., 1992 | 30. m/0.25 mm/0.25 μm, Hydrogen, 60. C @ 5. min, 2. K/min, 250. C @ 2. min |
Capillary | DB-1 | 1053. | Velasco-Negueruela, Pérez Alonso, et al., 1991 | N2, 4. K/min; Column length: 30. m; Tstart: 80. C; Tend: 220. C |
Capillary | BP-1 | 1080. | Wyllie, Brophy, et al., 1990 | 45. C @ 3. min, 3. K/min; Column length: 25. m; Column diameter: 0.33 mm; Tend: 180. C |
Capillary | OV-101 | 1081. | Yang and Sugisawa, 1990 | N2, 2. K/min; Column length: 50. m; Column diameter: 0.25 mm; Tstart: 80. C; Tend: 200. C |
Capillary | OV-101 | 1084. | Yang and Sugisawa, 1990 | N2, 2. K/min; Column length: 50. m; Column diameter: 0.25 mm; Tstart: 80. C; Tend: 200. C |
Capillary | BP-1 | 1081. | Brophy, Davies, et al., 1989 | H2, 40. C @ 1. min, 10. K/min; Column length: 50. m; Column diameter: 0.30 mm; Tend: 250. C |
Capillary | SE-30 | 1077. | de Pooter, de Buyck, et al., 1989 | 40. m/0.50 mm/0.75 μm, He, 3. K/min; Tstart: 30. C; Tend: 220. C |
Capillary | OV-101 | 1081. | Sugisawa, Yamamoto, et al., 1989 | N2, 2. K/min; Column length: 50. m; Column diameter: 0.25 mm; Tstart: 80. C; Tend: 200. C |
Capillary | OV-101 | 1081. | Sugisawa, Yang, et al., 1989 | N2, 2. K/min; Column length: 50. m; Column diameter: 0.25 mm; Tstart: 80. C; Tend: 200. C |
Capillary | OV-101 | 1084. | Sugisawa, Yang, et al., 1989 | N2, 2. K/min; Column length: 50. m; Column diameter: 0.25 mm; Tstart: 80. C; Tend: 200. C |
Capillary | DB-1 | 1077. | Engel, Flath, et al., 1988 | 60. m/0.315 mm/0.25 μm, He, 4. K/min; Tstart: 50. C; Tend: 250. C |
Capillary | OV-1 | 1077. | Wahab, Aboutabl, et al., 1987 | 60. m/0.50 mm/1.2 μm, Helium, 2. K/min; Tstart: 40. C; Tend: 220. C |
Capillary | OV-101 | 1078. | Nykanen, 1986 | 40. C @ 5. min, 3.5 K/min; Column length: 50. m; Column diameter: 0.30 mm; Tend: 230. C |
Capillary | OV-101 | 1091. | Nykanen, 1986 | 40. C @ 5. min, 3.5 K/min; Column length: 50. m; Column diameter: 0.30 mm; Tend: 230. C |
Capillary | OV-1 | 1077. | de Pooter, de Buyck, et al., 1986 | 40. m/0.5 mm/0.75 μm, He, 3. K/min; Tstart: 30. C; Tend: 220. C |
Capillary | OV-1 | 1077. | De Pooter, De Buyck, et al., 1986 | He, 2. K/min; Tstart: 40. C; Tend: 220. C |
Capillary | OV-101 | 1077. | De Pooter and Schamp, 1986 | 30. m/0.5 mm/0.8 μm, He, 2. K/min; Tstart: 40. C; Tend: 220. C |
Capillary | OV-101 | 1072. | del Rosario, de Lumen, et al., 1984 | He, 0. C @ 1. min, 3. K/min; Column length: 50. m; Column diameter: 0.31 mm; Tend: 225. C |
Capillary | SE-30+Igepal | 1082. | Shibamoto and Jennings, 1977 | 1. K/min; Column length: 100. m; Column diameter: 0.25 mm; Tstart: 70. C; Tend: 170. C |
Capillary | SE-30+Igepal | 1085. | Shibamoto and Jennings, 1977 | 1. K/min; Column length: 100. m; Column diameter: 0.25 mm; Tstart: 70. C; Tend: 170. C |

Normal alkane RI, non-polar column, custom temperature program

Column type | Active phase | I | Reference | Comment |
---|---|---|---|---|
Capillary | DB-1 | 1064. | Albano, Lima, et al., 2012 | 30. m/0.25 mm/0.25 μm, Hydrogen; Program: 45 0C 3 0C/min -> 175 0C 15 0C/min -> 300 0C (10 min) |
Capillary | RTX-1 | 1079. | Bendiabdellah, El Amine Dib, et al., 2012 | 60. m/0.22 mm/0.25 μm, Helium; Program: not specified |
Capillary | RTX-1 | 1079. | Bendiabdellah, El Amine Dib, et al., 2012 | 60. m/0.22 mm/0.25 μm, Helium; Program: not specified |
Capillary | Mega-5 | 1089. | Dell'Agli, Sanna, et al., 2012 | 25. m/0.25 mm/0.25 μm, Helium; Program: not specified |
Capillary | HP-5 | 1089. | Velickovic, Ristic, et al., 2012 | 25. m/0.32 mm/0.52 μm, Hydrogen; Program: not specified |
Capillary | Siloxane, 5 % Ph | 1089. | VOC BinBase, 2012 | Program: not specified |
Capillary | 5 % Phenyl polydimethyl siloxane | 1089. | Chaverri, Diaz, et al., 2011 | Program: not specified |
Capillary | CP-Sil 8 CB | 1084. | de Freitas, Garruti, et al., 2011 | 30. m/0.25 mm/0.25 μm, Hydrogen; Program: 30 0C 3 0C/min -> 150 0C 20 0C/min -> 220 0C |
Capillary | 1088. | Karimi, Farmany, et al., 2011 | Program: not specified | |
Capillary | HP-5 | 1092. | Laribi, Kouki, et al., 2011 | 30. m/0.25 mm/0.25 μm, Nitrogen; Program: 35 0C (10 min) 3 0C/min -> 205 0C 10 0C/min -> 225 0C |
Capillary | DB-5 | 1100. | Miyazaki, Plotto, et al., 2011 | 60. m/0.25 mm/1.00 μm, Helium; Program: 40 0C 4 0C/min -> 230 0C 100 0C/min -> 260 0C (11.7 min) |
Capillary | Polydimethyl siloxane, 5 % phenyl | 1089. | Skogerson, Wohlgemuth, et al., 2011 | Program: not specified |
Capillary | HP-5 MS | 1083. | Bamoniri, Mirjalili, et al., 2010 | 30. m/0.25 mm/0.25 μm, Helium; Program: 50 0C (2 min) 3 0C/min -> 130 0C (2 min) 5 0C/min -> 270 0C |
Capillary | RTX-1 | 1079. | Dib, Djabou, et al., 2010 | 60. m/0.22 mm/0.25 μm, Helium; Program: not specified |
Capillary | HP-5 | 1089. | Kahriman, Tosun, et al., 2010 | 30. m/0.32 mm/0.25 μm, Helium; Program: not specified |
Capillary | HP-5 MS | 1088. | Pino, Marquez, et al., 2010 | 30. m/0.32 mm/0.25 μm, Helium; Program: not specified |
Capillary | DB-5 | 1084. | Pontes, Silva, et al., 2010 | 30. m/0.25 mm/0.25 μm, Hydrogen; Program: 35 0C (2 min) 4 0C/min -> 180 0C 20 0C/min -> 280 0C |
Capillary | SLB-5 MS | 1086. | Scandinaro, Tranchida, et al., 2010 | 10. m/0.10 mm/0.10 μm, Helium; Program: not specified |
Capillary | HP-5 MS | 1087. | Sharifiar, Yassa, et al., 2010 | 30. m/0.25 mm/0.25 μm, Helium; Program: 50 0C (3 min) 3 0C/min -> 160 0C (10 min) 3 0C/min -> 240 0C |
Capillary | DB-1-MS | 1077. | Takeoka, Hobbs, et al., 2010 | 60. m/0.25 mm/0.25 μm, Helium; Program: not specified |
Capillary | DB-5 | 1089. | Courtois, Paine, et al., 2009 | 30. m/0.25 mm/0.25 μm, Helium; Program: 50 0C m6 0C/min -> 140 0C 5 0C/min -> 160 0C (1 min) 10 0C/min -> 200 0C |
Capillary | DB-5 | 1083. | Courtois, Paine, et al., 2009 | 30. m/0.25 mm/0.25 μm, Helium; Program: 50 0C m6 0C/min -> 140 0C 5 0C/min -> 160 0C (1 min) 10 0C/min -> 200 0C |
Capillary | DB-1 | 1086. | Delort and Jaquier, 2009 | 60. m/0.25 mm/0.25 μm, Helium; Program: 50 0C (5 min) 3 0C/min -> 120 0C 5 0C/min -> 250 0C (3 min) 15 0C/min -> 300 0C (20 min) |
Capillary | 5 % Phenyl methyl siloxane | 1094. | Huang, Qin, et al., 2009 | 30. m/0.25 mm/0.25 μm, Helium; Program: 50 0C (2 min) 10 0C/min -> 150 0C 15 0C/min -> 300 0C (10 min) |
Capillary | Elite-5 MS | 1078. | Kapoor, Singh, et al., 2009 | 30. m/0.25 mm/0.25 μm, Helium; Program: 60 0C (1 min) 1.5 0C/min -> 185 0C (1 min) 9 0C/min -> 275 0C (2 min) |
Capillary | RTX-5 | 1090. | Leela, Vipin, et al., 2009 | 30. m/0.25 mm/0.25 μm, Nitrogen; Program: 60 0C 95 min) 110 0C 3 0C/min -> 200 0C 5 0C/min -> 220 0C 95 min) |
Capillary | RTX-5 | 1089. | Leela, Vipin, et al., 2009 | 30. m/0.25 mm/0.25 μm, Nitrogen; Program: not specified |
Capillary | HP-5 | 1089. | Maggi, Bilek, et al., 2009 | 25. m/0.32 mm/0.17 μm, Helium; Program: 60 0C (5 min) 4 0C/min -> 220 0C 11 0C/min -> 280 0C |
Capillary | DB-1 | 1064. | Mendes, Trindade, et al., 2009 | 30. m/0.25 mm/0.25 μm, Hydrogen; Program: 45 0C 3 0C/min -> 175 0C 15 0C/min -> 300 0C (10 min) |
Capillary | DB-1 | 1064. | Mendes, Trindade, et al., 2009, 2 | 30. m/0.25 mm/0.25 μm, Hydrogen; Program: 45 0C 3 0C/min -> 175 0C 15 0C/min -> 300 0C (10 min) |
Capillary | DB-5 | 1088. | Porto, Decorti, et al., 2009 | 30. m/0.25 mm/0.25 μm, Helium; Program: not specified |
Capillary | DB-5 | 1090. | Porto, Decorti, et al., 2009 | 30. m/0.25 mm/0.25 μm, Helium; Program: not specified |
Capillary | HP-5 | 1086. | Riahi, Pourbasheer, et al., 2009 | Column length: 30. m; Column diameter: 0.32 mm; Program: not specified |
Capillary | DB-5 MS | 1088. | Su, Wang, et al., 2009 | 30. m/0.25 mm/0.25 μm, Helium; Program: not specified |
Capillary | DB-1 HT | 1067. | Yang, Kim, et al., 2009 | 30. m/0.32 mm/0.10 μm, Helium; Program: 40 0C 2 0C/min -> 100 0C 5 0C/min -> 230 0C (5 min) |
Capillary | SLB-5 MS | 1086. | Costa, De Fina, et al., 2008 | 30. m/0.25 mm/0.25 μm, Helium; Program: 50 0C 3 0C/min -> 250 0C (1 min) 10 0C/min -> 300 0C (5 min) |
Capillary | SLB-5 MS | 1086. | Costa, De Fina, et al., 2008 | 30. m/0.25 mm/0.25 μm, Helium; Program: not specified |
Capillary | HP-5 | 1090. | Isidorov, Lech, et al., 2008 | 30. m/0.25 mm/0.25 μm, Helium; Program: not specified |
Capillary | CB-1 | 1072. | Kannaste, Vongvanich, et al., 2008 | 30. m/0.25 mm/0.25 μm, Helium; Program: 40 0C (2 min) 4 0C/min -> 180 0C 20 0C/min -> 220 0C (1 min) |
Capillary | CB-1 | 1082. | Kannaste, Vongvanich, et al., 2008 | 30. m/0.25 mm/0.25 μm, Helium; Program: not specified |
Capillary | CP Sil 8 CB | 1089. | Kupcinskiene, Stikliene, et al., 2008 | 50. m/0.32 mm/0.25 μm, Helium; Program: not specified |
Capillary | SLB-5 MS | 1086. | Lo Presti, Sciarrone, et al., 2008 | 30. m/0.25 mm/0.25 μm, Helium; Program: not specified |
Capillary | DB-1 | 1064. | Nogueira, Marcelo-Curto, et al., 2008 | 30. m/0.25 mm/0.25 μm, He; Program: 45C => 3C/min => 175C => 15C/min => 300C (10min) |
Capillary | HP-5 | 1089. | Qiao, Xie, et al., 2008 | 30. m/0.25 mm/0.25 μm, Helium; Program: 40 0C (3 min) 3 0C/min -> 160 0C (2 min) 8 0C/min -> 220 0C (3 min) |
Capillary | HP-5 | 1096. | Qiao, Xie, et al., 2008 | 30. m/0.25 mm/0.25 μm, Helium; Program: not specified |
Capillary | BPX-5 | 1086. | Shellie, 2008 | 7.5 m/0.10 mm/10. μm, Helium; Program: not specified |
Capillary | RTX-5 | 1090. | Zachariah, Leela, et al., 2008 | 30. m/0.25 mm/0.25 μm, Helium; Program: 60 0C (5 min) 5 0C/min -> 110 0C 3 0C/min -> 220 0C (5 min) |
Capillary | RTX-5 | 1089. | Zachariah, Leela, et al., 2008 | 30. m/0.25 mm/0.25 μm, Helium; Program: not specified |
Capillary | 5 % Phenyl methyl siloxane | 1096. | Agabriel, Cornu, et al., 2007 | Program: not specified |
Capillary | HP-1 | 1079. | Barra, Baldovini, et al., 2007 | 50. m/0.2 mm/0.33 μm, He; Program: 40C(2min) => 2C/min => 200C => 15C/min => 250C (30min) |
Capillary | DB-5MS | 1083. | Barra A., Coroneo V., et al., 2007 | 30. m/0.25 mm/0.25 μm, He; Program: 60C => 1C/min => 65C => 3C/min => 120C => 5C/min => 180C(5min) => 5C/min => 250C (20min) |
Capillary | DB-5 MS | 1097. | Cajka, Hajslova, et al., 2007 | 30. m/0.25 mm/0.25 μm, Helium; Program: 45 0C (0.75 min) 10 0C/min -> 200 0C 30 0C/min -> 245 0C (1.25 min) |
Capillary | CBP-5 | 1082. | Cheriti, Saad, et al., 2007 | 30. m/0.25 mm/0.25 μm, He; Program: 60C(2min) => 3C/min => 240C => 10C/min => 300C |
Capillary | SPB-1 | 1077. | Díaz-Maroto, Castillo, et al., 2007 | 50. m/0.25 mm/0.25 μm; Program: 70C(3min) => 4C/min => 120C => 8C/min => 250C(5min) |
Capillary | DB-1 | 1064. | Ferreira, Meireles de Sousa, et al., 2007 | 30. m/0.25 mm/0.25 μm, He; Program: 45C => 3C/min => 175C => 15C/min => 300C (10min) |
Capillary | HP-5MS | 1086. | Formisano, Mignola, et al., 2007 | 30. m/0.25 mm/0.25 μm, He; Program: 40C(5min) => 2C/min => 250C(15min) => 10C/min => 270C |
Capillary | DB-1 | 1064. | Kamatou, Viljoen, et al., 2007 | 30. m/0.25 mm/0.25 μm, H2; Program: 45 0C 3 0C/min -> 175 0C 15 0C/min -> 300 0C (10 min) |
Capillary | HP-5MS | 1088. | Liu, Song, et al., 2007 | 30. m/0.25 mm/0.25 μm, He; Program: 40C(3min) => 8C/min => 160C => 15C/min => 300C (10min) |
Capillary | HP-5MS | 1088. | Moronkola, Ogunwande, et al., 2007 | 30. m/0.25 mm/0.25 μm, He; Program: 40C(10min) => 3C/min => 200C => 2C/min => 220C |
Capillary | DB-5 | 1089. | Nivinsliene, Butkiene, et al., 2007 | 50. m/0.32 mm/0.25 μm, Helium; Program: 60 0C (1 min) 5 0C/min -> 160 0C 10 0C/min -> 250 0C |
Capillary | DB-1 | 1091. | Rao, Maia, et al., 2007 | 30. m/0.25 mm/0.25 μm, Helium; Program: 35 0C 4 0C/min -> 180 0C 10 0C/min -> 250 0C |
Capillary | BPX-5 | 1094. | Salamci, Kordali, et al., 2007 | 30. m/0.25 mm/0.25 μm, He; Program: 50C => 3C/min => 150C(10min) => 10C/min => 250C |
Capillary | 5 % Phenyl methylsiloxane | 1098. | Serrano, Cornu, et al., 2007 | Program: not specified |
Capillary | HP-5 MS | 1089. | Setzer, Stokes, et al., 2007 | Helium; Column length: 30. m; Column diameter: 0.25 mm; Program: 40 0C (10 min) 3 oC/min -> 200 0C 2 0C/min -> 220 0C |
Capillary | HP-5MS | 1089. | Takaku, Haber, et al., 2007 | He; Column length: 30. m; Column diameter: 0.25 mm; Program: 40C(10min) => 3C/min => 200C => 2C/min => 220C |
Capillary | BPX-5 | 1094. | Baris, Güllüce, et al., 2006 | 30. m/0.25 mm/0.25 μm, He; Program: 50C => 3C/min => 150C(10min) => 10C/min => 250C |
Capillary | SPB-5 | 1078. | Chemat, Lucchesi, et al., 2006 | 60. m/0.32 mm/1. μm, He; Program: 60C => 1C/min => 130C => 2C/min => 200C => 4C/min => 250C (40min) |
Capillary | HP-5MS | 1089. | Deng, Xu, et al., 2006 | 30. m/0.25 mm/0.25 μm, He; Program: 50C(2min) => 6C/min => 200C => 10C/min => 270C(10min) |
Capillary | DB-1 | 1064. | Figueiredo A.C., Barroso J.G., et al., 2006 | 30. m/0.25 mm/0.25 μm, He; Program: 45C => 3C/min => 175C => 15C/min => 300C (10min) |
Capillary | CP Sil 8 CB | 1089. | Judzentiene and Buzelyte, 2006 | 50. m/0.32 mm/0.25 μm, He; Program: 60C(2min) => 5C/min => 160C(1min) => 10C/min => 250C (5min) |
Capillary | DB-1 | 1089. | de Lima, Maia, et al., 2006 | He; Column length: 30. m; Column diameter: 0.25 mm; Program: 35C => 4C/min => 180C => 10C/min => 250C |
Capillary | SE-52 | 1111. | Lorenzo, Loayza, et al., 2006 | 25. m/0.32 mm/0.42 μm, H2; Program: 60C(8min) => 3C/min => 180C => 20C/min => 250C (10min) |
Capillary | HP-5MS | 1089. | Singh, Marimuthu, et al., 2006 | 30. m/0.25 mm/0.25 μm, He; Program: 60C => 1.5C/min => 185C(1min) => 9C/min => 275C(2min) |
Capillary | HP-5MS | 1088. | Singh G., Maurya S., et al., 2006 | 30. m/0.32 mm/0.25 μm, He; Program: 60C(1min) => 1.5C => 185C => 9C/min => 275C (2min) |
Capillary | DB-5 | 1087. | Srivastava, Mallavarapu, et al., 2006 | 30. m/0.32 mm/0.25 μm, He; Program: 60C => 2C/min => 100C => 3C/min => 160C => 5C/min => 280C |
Capillary | SE-52 | 1089. | Tognolini, Barocelli, et al., 2006 | 30. m/0.32 mm/0.15 μm, He; Program: 45C => 1C/min => 100C => 5C/min => 250C (10min) |
Capillary | DB-5MS | 1083. | Tuberoso, Barra, et al., 2006 | 30. m/0.25 mm/0.25 μm, He; Program: 60C => 3C/min => 180C => 250C (2min) |
Capillary | HP-5MS | 1087. | Alissandrakis, Kibaris, et al., 2005 | 30. m/0.25 mm/0.25 μm, He; Program: 40C(3min) => 2C/min => 180C => 10C/min => 250C(5min) |
Capillary | DB-5MS | 1084. | Bagci and Baser, 2005 | 30. m/0.25 mm/0.25 μm; Program: 70C(2min) => 10C/min => 150C(15min) => 5C/min => 240C |
Capillary | DB-1 | 1064. | Belhattab, Larous, et al., 2005 | 30. m/0.25 mm/0.25 μm, He; Program: 45C => 3C/min => 175C => 15C/min => 300C(10min) |
Capillary | CP Sil 8 CB | 1089. | Butkienë, Nivinskienë, et al., 2005 | 50. m/0.32 mm/0.25 μm, He; Program: 50C(5min) => 2C/min => 90C => 15C/min => 240C(4min) |
Capillary | BP-5 | 1092. | Eyres, Dufour, et al., 2005 | 25. m/0.32 mm/0.50 μm, Helium; Program: 60 0C 6 0C/min -> 210 0C 10 0C/min -> 290 0C (10 min) |
Capillary | BP-5 | 1091. | Eyres, Dufour, et al., 2005 | 25. m/0.32 mm/0.50 μm, Helium; Program: not specified |
Capillary | BP-5 | 1084. | Eyres, Dufour, et al., 2005 | 25. m/0.32 mm/0.50 μm, Helium; Program: 60 0C 6 0C/min -> 210 0C 10 0C/min -> 290 0C (10 min) |
Capillary | BP-5 | 1086. | Eyres, Dufour, et al., 2005 | 25. m/0.32 mm/0.50 μm, Helium; Program: 60 0C 6 0C/min -> 210 0C 10 0C/min -> 290 0C (10 min) |
Capillary | BP-5 | 1089. | Eyres, Dufour, et al., 2005 | 25. m/0.32 mm/0.50 μm, Helium; Program: 60 0C 6 0C/min -> 210 0C 10 0C/min -> 290 0C (10 min) |
Capillary | BP-5 | 1089. | Eyres, Dufour, et al., 2005 | 25. m/0.32 mm/0.50 μm, Helium; Program: 60 0C 6 0C/min -> 210 0C 10 0C/min -> 290 0C (10 min) |
Capillary | BP-5 | 1091. | Eyres, Dufour, et al., 2005 | 25. m/0.32 mm/0.50 μm, Helium; Program: 60 0C 6 0C/min -> 210 0C 10 0C/min -> 290 0C (10 min) |
Capillary | BP-5 | 1094. | Eyres, Dufour, et al., 2005 | 25. m/0.32 mm/0.50 μm, Helium; Program: 60 0C 6 0C/min -> 210 0C 10 0C/min -> 290 0C (10 min) |
Capillary | DB-1 | 1064. | Faleio, Miguel, et al., 2005 | 30. m/0.25 mm/0.25 μm, He; Program: 45C => 3C/min => 175C => 15C/min => 300C (10min) |
Capillary | DB-1 | 1064. | Figueiredo, Sim-Sim, et al., 2005 | 30. m/0.25 mm/0.25 μm, He; Program: 45C => 3C/min => 175C => 15C/min => 300C (10min) |
Capillary | BPX-5 | 1088. | Judzentiene and Mockute, 2005 | 30. m/0.25 mm/0.25 μm; Program: 60C(0.2min) => 3K/min => 186C => 10C/min => 240C (5min) |
Capillary | BPX-5 | 1087. | Koutsoudaki, Krsek, et al., 2005 | 30. m/0.32 mm/0.5 μm, He; Program: 60C(1min) => 3.5C/min => 180C => 20C/min => 280C(2min) |
Capillary | CP Sil 8 CB | 1088. | Nivinskienë, Butkienë, et al., 2005 | 50. m/0.32 mm/0.25 μm, He; Program: 60C(1min) => 5C/min => 160C => 5C/min => 250C(3min) |
Capillary | HP-5MS | 1088. | Novak, Draxler, et al., 2005 | 30. m/0.25 mm/0.25 μm; Program: 40C(5min) => 3C/min => 90C => 10C/min => 280C |
Capillary | DB-1 | 1088. | Omidbaigi and Bastan, 2005 | Program: not specified |
Capillary | Polydimethyl siloxane with 5 % Ph groups | 1086. | Pino, Marbot, et al., 2005, 2 | Program: not specified |
Capillary | CP Sil 8 CB | 1088. | Radudienë, Judpintienë, et al., 2005 | 50. m/0.32 mm/0.25 μm, He; Program: 60C(2min) => 5C/min => 160C(1min) => 10C/min => 250C (3min) |
Capillary | HP-5 | 1088. | Singh, Maurya, et al., 2005 | Column length: 30. m; Column diameter: 0.32 mm; Program: 65C(1min) => 1C/min => 75C (2min) => 0.5C/min => 81C(2min) => 3C/min => 180C(7min) |
Capillary | CP Sil 8 CB | 1089. | Butkienë, Nivinskienë, et al., 2004 | 50. m/0.32 mm/0.25 μm, He; Program: 50C(5min) => 2C/min => 90C => 15C/min => 240C(4min) |
Capillary | Methyl Silicone | 1086. | Couladis, Özcan, et al., 2004 | Program: not specified |
Capillary | 1077. | El-Shazily, Hafez, et al., 2004 | Program: not specified | |
Capillary | OV-1 | 1077. | El-Shazly and Hussein, 2004 | He; Column length: 15. m; Column diameter: 0.317 mm; Program: 50C(4min) => 4C/min => 90C => 10C/min => 300C(10min) |
Capillary | OV-1 | 1077. | Hafez and Abdel-Salam, 2004 | 30. m/0.25 mm/0.25 μm, He; Program: 45 0C (4 min) 3 0C/min -> 75 0C 4 0C/min -> 115 0C 6 0C/min -> 312 0C |
Capillary | CP Sil 8 CB | 1088. | Judpentienë and Mockutë, 2004 | He; Column length: 50. m; Column diameter: 0.32 mm; Program: 60C(2min) => 5C/min => 160C (1min) => 10C/min => 250C (2min) |
Capillary | CP Sil 8 CB | 1088. | Judpentienë and Mockutë, 2004, 2 | 50. m/0.32 mm/0.25 μm, He; Program: 60C(2min) => 5C/min => 160C(1min) => 10C/min => 250C (5min) |
Capillary | DB-5 | 1088. | Letchamo, Ward, et al., 2004 | 30. m/0.25 mm/0.25 μm, He; Program: 60C(4min) => 6C/min => 240 => 10C/min => 280C |
Capillary | DB-5 | 1092. | Lo Cantore, Iacobellis, et al., 2004 | Program: not specified |
Capillary | DB-1 | 1064. | Miguel, Simões, et al., 2004 | 30. m/0.25 mm/0.25 μm, He; Program: 45C => 3C/min => 175C => 15C/min => 300C (10min) |
Capillary | CP Sil 8 CB | 1088. | Mockutë, Bernotienë, et al., 2004 | He; Column length: 50. m; Column diameter: 0.32 mm; Program: 50 0C (2 min) 3 0C/min -> 180 0C (1 min) 20 0C/min -> 250 0C (2 min) |
Capillary | CP Sil 8 CB | 1088. | Mockutë, Judbentienë, et al., 2004 | 50. m/0.32 mm/0.25 μm, He; Program: 50C(2min) => 3C/min => 180C(1min) => 20C/min => 250C (2min) |
Capillary | MDN-5 | 1081. | Moretti, Madonia, et al., 2004 | 30. m/0.25 mm/0.25 μm, Helium; Program: 30 0C (1 min) ballistically -> 60 0C 2 0C/min -> 120 0C 5 0C/min -> 280 0C (5 min) |
Capillary | HP-5MS | 1088. | Singh, Marimuthu, et al., 2004 | 30. m/0.25 mm/0.25 μm; Program: 60C(1min) => 1.5C/min => 185C(1min) => 9C/min => 275C(2min) |
Capillary | HP-5MS | 1088. | Singh, Maurya, et al., 2004 | 30. m/0.25 mm/0.25 μm, He; Program: 60C(1min) => 0.5C/min => 85C(1min) => 1C/min => 105C (2min) => 10C/min => 275C(2min) |
Capillary | HP-5 | 1089. | Tepe, Donmez, et al., 2004 | 30. m/0.25 mm/0.25 μm, He; Program: 50C (3min) => 3C/min => 150C (10min) => 10C/min => 250C |
Capillary | DB-5 | 1088. | Vilaseca, Guy, et al., 2004 | Program: not specified |
Capillary | SE-30 | 1079. | Vinogradov, 2004 | Program: not specified |
Capillary | SE-30 | 1083. | Vinogradov, 2004 | Program: not specified |
Capillary | HP-5 | 1088. | Demyttenaere, Dagher, et al., 2003 | 30. m/0.25 mm/0.25 μm, He; Program: 40C(1min) => 5C/min => 180C => 10C/min => 220C(2min) |
Capillary | Methyl Silicone | 1091. | Demyttenaere, Morina, et al., 2003 | He; Program: 60 0C 3 0C/min -> 200 0C 15 0C/min -> 250 0C (5 min) |
Capillary | HP-5 | 1089. | Güllüce, Sökmen, et al., 2003 | 30. m/0.25 mm/0.25 μm, He; Program: 50C(3min) => 3C/min => 150C(10min) => 10 C/min => 250C |
Capillary | CP-Sil 8CB-MS | 1088. | Mockute, Bernotiene, et al., 2003 | He; Column length: 50. m; Column diameter: 0.32 mm; Program: 50C(2min) => 3C/min => 180C(1min) => 20C/min => 250C(2min) |
Capillary | CP Sil 8 CB | 1088. | Mockute and Judzentiene, 2003, 2 | 50. m/0.32 mm/0.25 μm, He; Program: 70C(5min) => 3C/min => 100C (1min) => 25C/min => 250C (10min) |
Capillary | CP Sil 8 CB | 1088. | Mockute, Nivinskiene, et al., 2003 | 50. m/0.32 mm/0.25 μm, He; Program: 60C(1min) => 5C/min => 160C => 10C/min => 250C(5min) |
Capillary | HP-5 | 1090. | Singh, Singh, et al., 2003 | 30. m/0.25 mm/0.25 μm, He; Program: 60C(5min) => 1C/min => 140C => 10C/min => 270C(5min) |
Capillary | HP-5MS | 1088. | Demyttenaere, Dagher, et al., 2002 | 30. m/0.25 mm/0.25 μm, He; Program: 40C(1min) => 5C/min => 220C => 10C/min => 240C(2min) |
Capillary | HP-5MS | 1091. | Demyttenaere, Moriña, et al., 2002 | 25. m/0.25 mm/0.25 μm, He; Program: 40C(2min) => 8C/min => 160C => 15C/min => 250C(3min) |
Capillary | SE-30 | 1082. | Li, Wu, et al., 2002 | He; Column length: 60. m; Column diameter: 0.25 mm; Program: 50 0C (5 min) 5 0C/min -> 165 0C 4 0C/min -> 230 0C |
Capillary | SE-30 | 1081. | Li, Wu, et al., 2002 | He; Column length: 60. m; Column diameter: 0.25 mm; Program: not specified |
Capillary | CP Sil 8 CB | 1088. | Mockute and Judzentiene, 2002 | He; Column length: 50. m; Column diameter: 0.32 mm; Program: 60C(2min) => 5C/min => 160C(1min) => 10C/min => 250C (2min) |
Capillary | CP Sil 8 CB | 1088. | Mockute and Judzentiene, 2002, 2 | He; Column length: 50. m; Column diameter: 0.32 mm; Program: 60C(2min) => 5C/min => 160C(1min) => 10C/min => 250C(2min) |
Capillary | HP-1 | 1105. | Nogueira and Romano, 2002 | 30. m/0.32 mm/0.25 μm, He; Program: 40C(3min) => 5C/min => 180C => 15C/min => 240C(15min) |
Capillary | DB-5 | 1088. | Viana, Andrade-Neto, et al., 2002 | 30. m/0.25 mm/0.1 μm, He; Program: 35C => 4C/min => 180C => 20C/min => 280C |
Capillary | DB-5 | 1082. | Viana, Andrade-Neto, et al., 2002, 2 | 30. m/0.25 mm/0.25 μm, He; Program: 35C => 4C/min => 180C => 20C/min => 280C |
Capillary | HP-5MS | 1086. | Ansorena, Gimeno, et al., 2001 | 30. m/0.25 mm/0.25 μm, He; Program: 40C (10min) => 3C/min => 120C => 10C/min => 250C (5min) |
Capillary | HP-5 | 1079. | Aparicio, Romero, et al., 2001 | 30. m/0.25 mm/0.25 μm; Program: not specified |
Capillary | DB-5 | 1074. | Ferreira, Costantin, et al., 2001 | Program: not specified |
Capillary | DB-1 | 1064. | Figueiredo, Miguel, et al., 2001 | 30. m/0.25 mm/0.25 μm; Program: 45 0C 3 K/min -> 175 0C 15 K/min -> 300 0C (10 min) |
Capillary | CBP-1 | 1077. | Ly, Yamauchi, et al., 2001 | 25. m/0.25 mm/0.25 μm, Nitrogen; Program: not specified |
Capillary | DB-5 | 1084. | Petrakis, Tsitsimpikou, et al., 2001 | Program: not specified |
Capillary | HP-5 | 1080. | Usubillaga, Aparicio, et al., 2001 | 30. m/0.25 mm/0.25 μm, He; Program: 50 0C 3 K/min -> 200 0C 8 K/min -> 280 0C |
Capillary | OV-101 | 1081. | Yang, 2001 | N2; Column length: 50. m; Column diameter: 0.25 mm; Program: not specified |
Capillary | DB-5 | 1088. | Andrade, Maia, et al., 2000 | 30. m/0.25 mm/0.25 μm, He; Program: 40C => 2C/min => 60C => 4C/min => 260C |
Capillary | HP-1 | 1073. | Betts, 2000 | 12. m/0.20 mm/0.33 μm, He; Program: 40 0C 6.7 0C/min -> 87 0C (9 min) 10 0C/min -> 187 0C |
Capillary | DB-1 | 1064. | Dorman, Figueiredo, et al., 2000 | 30. m/0.25 mm/0.25 μm, H2; Program: 40 0C 3 K/min -> 175 0C 15 K/min -> 240 0C (10 min) |
Capillary | DB-1 | 1064. | da Silva, Pedro, et al., 2000 | 30. m/0.25 mm/0.25 μm, H2; Program: 40 0C 3 K/min -> 175 0C 15 K/min -> 240 0C (10 min) |
Capillary | CP-Sil5 CB MS | 1084. | Tirillini, Verdelli, et al., 2000 | 50. m/0.32 mm/0.4 μm; Program: 0C (3min) => 3C/min => 50C => 5C/min => 220C (30min) |
Capillary | DB-1 | 1064. | Pedro, da Silva, et al., 1999 | 30. m/0.25 mm/0.25 μm, He; Program: 45C => 3C/min => 170C => 15C/min => 300C(10min) |
Capillary | SE-30 | 1070. | Prikhod'ko, Klyuev, et al., 1999 | 30. m/0.25 mm/0.20 μm, Helium; Program: not specified |
Capillary | DB-1 | 1064. | Santos, Figueiredo, et al., 1999 | 30. m/0.25 mm/0.25 μm, He; Program: 45C => 3C/min => 175C => 15C/min => 300C(10min) |
Capillary | CP Sil 5 CB | 1082. | Weyerstahl, Marschall, et al., 1999, 2 | Column length: 25. m; Column diameter: 0.39 mm; Program: not specified |
Capillary | DB-1 | 1064. | Baratta, Dorman, et al., 1998 | 30. m/0.25 mm/0.25 μm, He; Program: 45C => 3C/min => 175C => 15C/min => 240C (10min) |
Capillary | DB-5 | 1100. | Sanda, Koba, et al., 1998 | 30. m/0.25 mm/0.25 μm, N2; Program: 45C(5min) => 2C/min => 200C => 5C/min => 250C |
Capillary | DB-1 | 1064. | da Silva, Figueiredo, et al., 1998 | 30. m/0.25 mm/0.25 μm, H2; Program: 45C => 3C/min => 175C => 15C => 240C(10min) |
Capillary | DB-5 | 1084. | Yusuf, Begum, et al., 1998 | 30. m/0.25 mm/0.25 μm, He; Program: 60C => 3C/min => 240C => 30C/min => 300C |
Capillary | DB-1 | 1064. | Figueiredo, Barroso, et al., 1997 | 30. m/0.25 mm/0.25 μm, H2; Program: 45C => 3C/min => 175C => 15C/min => 240C(10min) |
Capillary | DB-1 | 1064. | Gaspar, Palma, et al., 1997 | 30. m/0.25 mm/0.25 μm, He; Program: 45C => 3C/min => 175C => 15C/min => 280C |
Capillary | DB-5 | 1088. | Isidorov, Zenkevich, et al., 1997 | Program: not specified |
Capillary | SPB-Sulfur | 1080. | Mariaca, Berger, et al., 1997 | 30. m/0.32 mm/4. μm, He; Program: not specified |
Capillary | CP Sil 5 CB | 1083. | Weyerstahl, Marschall, et al., 1997 | N2; Column length: 30. m; Column diameter: 0.25 mm; Program: not specified |
Capillary | Methyl Silicone | 1079. | Zenkevich, 1996 | Program: not specified |
Capillary | DB-1 | 1080. | Ciccioli, Brancaleoni, et al., 1993 | 60. m/0.32 mm/0.25 μm; Program: 3 min at 5 C; 5 - 50 C at 3 deg/min; 50 - 220 C at 5 deg/min |
Capillary | DB-5 | 1075. | Storer, Elmore, et al., 1993 | 30. m/0.32 mm/1. μm; Program: 0C(5min) => 60C/min => 60C (5min) => 4C/min => 250C (5min) |
Capillary | DB-5 | 1075. | Storer, Elmore, et al., 1993 | 30. m/0.32 mm/1. μm; Program: 0C(5min) => 60C/min => 60C (5min) => 4C/min => 250C (5min) |
Capillary | DB-5 | 1079. | Storer, Elmore, et al., 1993 | 30. m/0.32 mm/1. μm; Program: 0C(5min) => 60C/min => 60C (5min) => 4C/min => 250C (5min) |
Capillary | SE-54 | 1090. | Blank, Fischer, et al., 1989 | 30. m/0.32 mm/0.3 μm, He; Program: 35C(2min) => 40C/min => 50C(2min) => 6C/min => 230C(10min) |
Capillary | OV-101 | 1077. | De Pooter, Vermeesch, et al., 1989 | Program: not specified |
Capillary | DB-1 | 1083. | MacLeod and Snyder, 1988 | Program: not specified |
Capillary | DB-1 | 1073. | Takeoka, Flath, et al., 1988 | 30. m/0.25 mm/0.25 μm, H2; Program: 30C (2min) => 2C/min => 150C => 4C/min => 250C |
Capillary | DB-1 | 1077. | Takeoka, Flath, et al., 1988 | 30. m/0.25 mm/0.25 μm, H2; Program: 30C (2min) => 2C/min => 150C => 4C/min => 250C |
Capillary | OV-1 | 1077. | De Pooter and Schamp, 1987 | 35. m/0.50 mm/1.5 μm; Program: not specified |
Capillary | OV-101 | 1083. | Shibamoto, 1987 | Column length: 60. m; Column diameter: 0.25 mm; Program: not specified |
Packed | OV-101 | 1083. | Swigar and Silverstein, 1981 | N2, Chromosorb G 60-80mesh DMCS; Column length: 2.5 m; Program: not specified |

Normal alkane RI, polar column, temperature ramp

Column type | Active phase | I | Reference | Comment |
---|---|---|---|---|
Capillary | RTX-Wax | 1292. | Bendiabdellah, El Amine Dib, et al., 2012 | 60. m/0.22 mm/0.25 μm, Helium, 2. K/min, 230. C @ 5. min; Tstart: 60. C |
Capillary | HP-Innowax | 1290. | Menichini, Tundis, et al., 2011 | 30. m/0.25 mm/0.25 μm, Helium, 50. C @ 5. min, 5. K/min, 250. C @ 10. min |
Capillary | RTX-Wax | 1274. | Dib, Djabou, et al., 2010 | 60. m/0.22 mm/0.25 μm, Helium, 2. K/min, 230. C @ 30. min; Tstart: 60. C |
Capillary | DB-Wax | 1301. | Vahirua-Lechat, Mitermite, et al., 2010 | 30. m/0.25 mm/0.25 μm, Helium, 3. K/min, 240. C @ 2. min; Tstart: 80. C |
Capillary | Supelcowax | 1284. | Gauvin-Bialecki and Marodon, 2009 | 60. m/0.35 mm/0.25 μm, Nitrogen, 4. K/min, 230. C @ 40. min; Tstart: 60. C |
Capillary | Supelcowax 10 | 1283. | Koba, Catherine, et al., 2009 | 30. m/0.25 mm/0.25 μm, Helium, 5. K/min; Tstart: 50. C; Tend: 200. C |
Capillary | RTX-Wax | 1258. | Museli, Pau, et al., 2009 | 60. m/0.22 mm/0.25 μm, Helium, 2. K/min, 230. C @ 30. min; Tstart: 60. C |
Capillary | HP-Innowax | 1290. | Wannes, Mhamdi, et al., 2009 | 30. m/0.25 mm/0.52 μm, Nitrogen, 35. C @ 10. min, 3. K/min, 205. C @ 10. min |
Capillary | HP-Innowax | 1287. | Cheraif, Ben Jannet, et al., 2007 | 30. m/0.25 mm/0.25 μm, N2, 50. C @ 1. min, 5. K/min, 240. C @ 4. min |
Capillary | Carbowax | 1304. | Ferhat, Meklati, et al., 2007 | 60. m/0.2 mm/0.25 μm, He, 60. C @ 8. min, 2. K/min, 250. C @ 15. min |
Capillary | HP-Wax | 1286. | Fredj, Marzouk, et al., 2007 | 30. m/0.25 mm/0.25 μm, N2, 5. K/min, 250. C @ 10. min; Tstart: 50. C |
Capillary | HP-Innowax | 1282. | Hachicha, Skanji, et al., 2007 | 30. m/0.25 mm/0.25 μm, He, 2. K/min, 240. C @ 20. min; Tstart: 60. C |
Capillary | CP-Wax 52CB | 1284. | Hymete, Rohloff, et al., 2007 | 30. m/0.32 mm/0.25 μm, He, 40. C @ 1. min, 3. K/min, 220. C @ 2. min |
Capillary | TC-FFAP | 1292. | Kurose, Okamura, et al., 2007 | He, 3. K/min, 220. C @ 30. min; Column diameter: 0.25 mm; Phase thickness: 0.25 μm; Tstart: 60. C |
Capillary | TC-FFAP | 1290. | Kurose, Okamura, et al., 2007 | He, 3. K/min, 220. C @ 30. min; Column diameter: 0.25 mm; Phase thickness: 0.25 μm; Tstart: 60. C |
Capillary | Carbowax 20M | 1286. | Limberger, Scopel, et al., 2007 | 30. m/0.25 mm/0.25 μm, He, 3. K/min; Tstart: 60. C; Tend: 230. C |
Capillary | DB-Wax | 1277. | Pala-Paul, Brophy, et al., 2007 | 60. m/0.32 mm/0.25 μm, He, 4. K/min; Tstart: 70. C; Tend: 220. C |
Capillary | Supelcowax-10 | 1288. | Pinto, Salgueiro, et al., 2007 | 30. m/0.2 mm/0.2 μm, He, 3. K/min, 220. C @ 15. min; Tstart: 70. C |
Capillary | Carbowax | 1284. | Singh, Kumar, et al., 2007 | 60. m/0.25 mm/0.25 μm, He, 5. K/min; Tstart: 40. C; Tend: 180. C |
Capillary | Supelcowax-10 | 1296. | Sylvestre, Longtin, et al., 2007 | 30. m/0.25 mm/0.25 μm, 2. K/min, 210. C @ 33. min; Tstart: 40. C |
Capillary | Supelcowax-10 | 1296. | Sylvestre, Pichette, et al., 2007 | 30. m/0.25 mm/0.25 μm, 2. K/min, 250. C @ 33. min; Tstart: 40. C |
Capillary | Supelcowax-10 | 1283. | Vichi, Riu-Aumatell, et al., 2007 | 30. m/0.25 mm/0.25 μm, He, 40. C @ 5. min, 3. K/min, 250. C @ 10. min |
Capillary | DB-Wax | 1280. | Wei A. and Shibamoto T., 2007 | 60. m/0.25 mm/0.25 μm, He, 60. C @ 8. min, 3. K/min, 180. C @ 80. min |
Capillary | Innowax | 1280. | Abdelwahed, Hayder, et al., 2006 | 30. m/0.25 mm/0.25 μm, N2, 50. C @ 3. min, 9. K/min, 280. C @ 3. min |
Capillary | Innowax | 1285. | Abdelwahed, Hayder, et al., 2006 | 30. m/0.25 mm/0.25 μm, N2, 50. C @ 3. min, 9. K/min, 280. C @ 3. min |
Capillary | AT-Wax | 1290. | Borges, Rojas, et al., 2006 | 60. m/0.25 mm/0.25 μm, He, 4. K/min, 200. C @ 20. min; Tstart: 60. C |
Capillary | BP-20 | 1278. | Boti, Muselli, et al., 2006 | 50. m/0.22 mm/0.25 μm, He, 2. K/min, 220. C @ 20. min; Tstart: 60. C |
Capillary | DB-Wax | 1278. | Cai, Lin, et al., 2006 | 60. m/0.25 mm/0.5 μm, He, 50. C @ 2. min, 3. K/min, 230. C @ 20. min |
Capillary | Supelcowax 10 | 1288. | Cavaleiro, Pinto, et al., 2006 | 30. m/0.20 mm/0.20 μm, Helium, 3. K/min, 220. C @ 15. min; Tstart: 70. C |
Capillary | DB-Wax | 1294. | Choi H.S., 2006 | 60. m/0.25 mm/0.25 μm, He, 70. C @ 2. min, 2. K/min, 230. C @ 20. min |
Capillary | DB-Wax | 1292. | Choi, 2006 | 60. m/0.25 mm/0.25 μm, N2, 70. C @ 2. min, 2. K/min, 230. C @ 20. min |
Capillary | BP-20 | 1280. | Fanciullino, Tomi, et al., 2006 | 50. m/0.22 mm/0.25 μm, He, 2. K/min, 220. C @ 20. min; Tstart: 60. C |
Capillary | BP-20 | 1280. | Fanciullino, Tomi, et al., 2006 | 50. m/0.22 mm/0.25 μm, He, 2. K/min, 220. C @ 20. min; Tstart: 60. C |
Capillary | HP-20M | 1253. | Filippi, Lanfranchi, et al., 2006 | 50. m/0.2 mm/0.1 μm, He, 2. K/min, 220. C @ 30. min; Tstart: 60. C |
Capillary | CP-Wax 52CB | 1284. | Hymete, Rohloff, et al., 2006 | 30. m/0.32 mm/0.25 μm, He, 60. C @ 7. min, 3.3 K/min, 220. C @ 3. min |
Capillary | DB-Wax Etr | 1311. | Ibarz, Ferreira, et al., 2006 | 60. m/0.25 mm/0.25 μm, He, 40. C @ 5. min, 2. K/min, 230. C @ 100. min |
Capillary | DB-Wax | 1288. | Lan Phi N.T., Nishiyama C., et al., 2006 | 60. m/0.25 mm/0.25 μm, 70. C @ 2. min, 2. K/min, 230. C @ 20. min |
Capillary | Supelcowax | 1291. | Martin, Joseph, et al., 2006 | 30. m/0.32 mm/0.25 μm, N2, 5. K/min; Tstart: 50. C; Tend: 200. C |
Capillary | HP-Wax | 1280. | Marzouk, Mansour, et al., 2006 | 30. m/0.25 mm/0.25 μm, Nitrogen, 5. K/min, 280. C @ 5. min; Tstart: 50. C |
Capillary | HP-20M | 1280. | Marzouk, Neffati, et al., 2006 | 30. m/0.25 mm/0.25 μm, N2, 5. K/min, 250. C @ 10. min; Tstart: 50. C |
Capillary | DB-Innowax | 1287. | Mendivil, Rodrigues, et al., 2006 | 60. m/0.25 mm/0.25 μm, Helium, 3. K/min, 240. C @ 20. min; Tstart: 60. C |
Capillary | NB-20M | 1270. | Orav, Raal, et al., 2006 | 30. m/0.2 mm/0.25 μm, He, 2. K/min; Tstart: 50. C; Tend: 250. C |
Capillary | DB-Wax | 1289. | Sawamura, Onishi, et al., 2006 | 60. m/0.25 mm/0.25 μm, 70. C @ 2. min, 2. K/min, 230. C @ 20. min |
Capillary | Supelcowax-10 | 1285. | Wong, Lim, et al., 2006 | 30. m/0.25 mm/0.25 μm, He, 50. C @ 1. min, 4. K/min, 220. C @ 10. min |
Capillary | Supelcowax-10 | 1303. | Wong, Sivasothy, et al., 2006 | 30. m/0.25 mm/0.25 μm, He, 50. C @ 1. min, 4. K/min, 250. C @ 10. min |
Capillary | Carbowax 20M | 1265. | Fernandez, Lizzani-Cuvelier, et al., 2005 | 50. m/0.2 mm/0.25 μm, 60. C @ 60. min, 2. K/min; Tend: 250. C |
Capillary | Stabilwax | 1283. | Jirovetz, Buchbauer, et al., 2005, 2 | 30. m/0.32 mm/0.5 μm, H2, 40. C @ 5. min, 6. K/min, 280. C @ 5. min |
Capillary | Stabilwax | 1285. | Jirovetz, Buchbauer, et al., 2005, 3 | 30. m/0.32 mm/0.5 μm, 40. C @ 5. min, 6. K/min, 280. C @ 5. min |
Capillary | HP-20M | 1262. | Kulisic, Radonic, et al., 2005 | 50. m/0.20 mm/0.20 μm, Helium, 70. C @ 4. min, 4. K/min, 180. C @ 10. min |
Capillary | HP-20M | 1262. | Kulisic, Radonic, et al., 2005 | 50. m/0.20 mm/0.20 μm, Helium, 70. C @ 4. min, 4. K/min, 180. C @ 10. min |
Capillary | DB-Wax | 1271. | Lee, Umano, et al., 2005 | 30. m/0.25 mm/0.25 μm, He, 3. K/min, 180. C @ 40. min; Tstart: 50. C |
Capillary | DB-Wax | 1287. | Njoroge, Koaze, et al., 2005, 2 | 60. m/0.25 mm/0.25 μm, N2, 70. C @ 2. min, 2. K/min, 230. C @ 20. min |
Capillary | DB-Wax | 1287. | Njoroge, Koaze, et al., 2005, 3 | 60. m/0.25 mm/0.25 μm, N2, 70. C @ 2. min, 2. K/min, 230. C @ 20. min |
Capillary | DB-Wax | 1301. | Qian and Wang, 2005 | 60. m/0.32 mm/0.50 μm, Nitrogen, 35. C @ 4. min, 2. K/min, 235. C @ 30. min |
Capillary | CP-Wax 52CB | 1286. | Rohloff and Bones, 2005 | 30. m/0.32 mm/0.25 μm, He, 40. C @ 1. min, 4. K/min; Tend: 220. C |
Capillary | DB-Wax | 1233. | Salehi, Sonboli, et al., 2005 | 30. m/0.25 mm/0.25 μm, He, 4. K/min, 250. C @ 10. min; Tstart: 40. C |
Capillary | Supelcowax-10 | 1273. | Stevanovic, Garneau, et al., 2005 | 30. m/0.25 mm/0.25 μm, 40. C @ 2. min, 2. K/min, 210. C @ 33. min |
Capillary | Supelcowax-10 | 1283. | Vichi, Riu-Aumatell, et al., 2005 | 30. m/0.25 mm/0.25 μm, 40. C @ 5. min, 3. K/min, 220. C @ 10. min |
Capillary | Supelcowax-10 | 1285. | Wong, Lee, et al., 2005 | 30. m/0.25 mm/0.25 μm, He, 50. C @ 3. min, 4. K/min, 220. C @ 30. min |
Capillary | BP-20 | 1276. | Blanc, Muselli, et al., 2004 | 50. m/0.22 mm/0.25 μm, 2. K/min, 220. C @ 20. min; Tstart: 60. C |
Capillary | DB-Wax | 1323. | Chida, Sone, et al., 2004 | 60. m/0.25 mm/0.5 μm, 35. C @ 5. min, 4. K/min, 240. C @ 10. min |
Capillary | DB-Wax | 1297. | Choi, 2004 | 60. m/0.25 mm/0.25 μm, N2, 70. C @ 2. min, 2. K/min, 230. C @ 20. min |
Capillary | DB-Wax | 1292. | Choi, 2004, 2 | 60. m/0.25 mm/0.25 μm, N2, 70. C @ 2. min, 2. K/min, 230. C @ 20. min |
Capillary | Supelcowax-10 | 1261. | Gauvin, Ravaomanarivo, et al., 2004 | 60. m/0.2 mm/0.2 μm, He, 4. K/min, 200. C @ 40. min; Tstart: 60. C |
Capillary | DB-Wax | 1282. | Jiang and Kubota, 2004 | He, 60. C @ 4. min, 2. K/min; Column length: 60. m; Column diameter: 0.25 mm; Tend: 220. C |
Capillary | DB-Wax | 1282. | Jiang and Kubota, 2004 | He, 60. C @ 4. min, 2. K/min; Column length: 60. m; Column diameter: 0.25 mm; Tend: 220. C |
Capillary | Supelcowax-10 | 1251. | Lopez Arze, Collin, et al., 2004 | 30. m/0.25 mm/0.25 μm, 40. C @ 2. min, 2. K/min, 210. C @ 33. min |
Capillary | Innowax FSC | 1290. | Lourens, Reddy, et al., 2004 | Helium, 60. C @ 10. min, 4. K/min; Column length: 60. m; Column diameter: 0.25 mm; Tend: 220. C |
Capillary | Supelcowax-10 | 1280. | Orav, Stulova, et al., 2004 | 50. m/0.2 mm/0.25 μm, He, 2. K/min; Tstart: 70. C; Tend: 230. C |
Capillary | Supelcowax-10 | 1282. | Orav, Stulova, et al., 2004 | 50. m/0.2 mm/0.25 μm, He, 2. K/min; Tstart: 70. C; Tend: 230. C |
Capillary | DB-Wax | 1279. | Palá-Paúl, Brophy, et al., 2004 | 60. m/0.32 mm/0.25 μm, He, 3. K/min; Tstart: 35. C; Tend: 220. C |
Capillary | Innowax | 1309. | Palá-Paúl, García-Jiménez, et al., 2004 | 50. m/0.2 mm/0.2 μm, He, 4. K/min; Tstart: 70. C; Tend: 220. C |
Capillary | NB-20M | 1276. | Raal, Arak, et al., 2004 | 50. m/0.2 mm/0.25 μm, He, 2. K/min; Tstart: 50. C; Tend: 250. C |
Capillary | SW-10 | 1281. | Raal, Paaver, et al., 2004 | 50. m/0.20 mm/0.25 μm, He, 2. K/min; Tstart: 50. C; Tend: 230. C |
Capillary | DB-Wax | 1306. | Sawamura, Son, et al., 2004 | 60. m/0.25 mm/0.25 μm, 70. C @ 2. min, 2. K/min, 230. C @ 20. min |
Capillary | DB-Wax | 1306. | Sawamura, Sou, et al., 2004 | 60. m/0.25 mm/0.25 μm, Nitrogen, 70. C @ 2. min, 2. K/min; Tend: 230. C |
Capillary | HP-Wax | 1288. | Bertoli, Menichini, et al., 2003 | 30. m/0.25 mm/0.25 μm, N2, 60. C @ 10. min, 5. K/min; Tend: 220. C |
Capillary | HP-20M | 1265. | Mastelic and Jerkovic, 2003 | 50. m/0.2 mm/0.2 μm, He, 70. C @ 4. min, 4. K/min, 180. C @ 10. min |
Capillary | DB-Wax | 1291. | Mookdasanit, Tamura, et al., 2003 | Helium, 2. K/min, 210. C @ 60. min; Column length: 60. m; Column diameter: 0.25 mm; Tstart: 70. C |
Capillary | Supelcowax-10 | 1282. | Orav, Kailas, et al., 2003 | 50. m/0.2 mm/0.25 μm, He, 2. K/min; Tstart: 70. C; Tend: 230. C |
Capillary | Supelcowax-10 | 1281. | Rotman, Ahumada, et al., 2003 | 30. m/0.25 mm/0.25 μm, N2, 2. K/min; Tstart: 40. C; Tend: 230. C |
Capillary | HP-Innowax | 1290. | Stashenko, Jaramillo, et al., 2003 | 50. m/0.2 mm/0.2 μm, 50. C @ 5. min, 4. K/min; Tend: 220. C |
Capillary | Innowax | 1290. | Suleimenov, Atazharova, et al., 2003 | He, 60. C @ 10. min, 4. K/min, 220. C @ 10. min; Column length: 60. m; Column diameter: 0.25 mm |
Capillary | DB-Wax | 1280. | Tu, Onishi, et al., 2003 | 60. m/0.25 mm/0.25 μm, N2, 70. C @ 2. min, 2. K/min, 230. C @ 20. min |
Capillary | DB-Wax | 1278. | Tu, Onishi, et al., 2003, 2 | 60. m/0.25 mm/0.25 μm, N2, 70. C @ 2. min, 2. K/min, 230. C @ 20. min |
Capillary | HP-Innowax | 1298. | Velasco-Negueruela, Pérez-Alonso, et al., 2003 | 50. m/0.2 mm/0.2 μm, He, 5. K/min; Tstart: 70. C; Tend: 190. C |
Capillary | Carbowax 20M | 1299. | Zrira, Elamrani, et al., 2003 | 25. m/0.25 mm/0.25 μm, N2, 4. K/min, 250. C @ 10. min; Tstart: 50. C |
Capillary | DB-Wax | 1271. | Gancel, Ollé, et al., 2002 | 60. m/0.32 mm/0.25 μm, H2, 1.5 K/min, 245. C @ 20. min; Tstart: 40. C |
Capillary | Carbowax 20M | 1287. | Kasali, Winterhalter, et al., 2002 | 30. m/0.25 mm/0.325 μm, He, 4. K/min, 215. C @ 20. min; Tstart: 50. C |
Capillary | Supelcowax-10 | 1282. | Orav, Kailas, et al., 2002 | 60. m/0.2 mm/0.5 μm, He, 2. K/min; Tstart: 70. C; Tend: 220. C |
Capillary | DB-Wax | 1284. | Tu, Onishi, et al., 2002 | 60. m/0.25 mm/0.25 μm, N2, 70. C @ 2. min, 2. K/min, 230. C @ 20. min |
Capillary | DB-Wax | 1295. | Tu, Thanh, et al., 2002 | 60. m/0.25 mm/0.25 μm, N2, 2. K/min; Tstart: 70. C; Tend: 230. C |
Capillary | DB-Wax | 1268. | Umano, Hagi, et al., 2002 | 60. m/0.25 mm/0.25 μm, He, 40. C @ 2. min, 2. K/min; Tend: 200. C |
Capillary | DB-Wax | 1287. | Christoph, 2001 | 60. m/0.25 mm/0.25 μm, He, 3. K/min; Tstart: 45. C; Tend: 240. C |
Capillary | DB-Wax | 1278. | Jiang and Kubota, 2001 | He, 2. K/min; Column length: 60. m; Column diameter: 0.25 mm; Tstart: 40. C; Tend: 220. C |
Capillary | Stabilwax | 1282. | Jirovetz L., Buchbauer G., et al., 2001 | 30. m/0.32 mm/0.25 μm, H2, 60. C @ 5. min, 10. K/min, 280. C @ 5. min |
Capillary | BP-20 | 1278. | Lota, de Rocca Serra, et al., 2001 | 50. m/0.22 mm/0.25 μm, He, 2. K/min, 230. C @ 35. min; Tstart: 60. C |
Capillary | TC-Wax | 1286. | Miyazawa, Kurose, et al., 2001 | He, 4. K/min, 250. C @ 47. min; Column length: 60. m; Column diameter: 0.25 mm; Tstart: 80. C |
Capillary | PEG-20M | 1281. | Orav, Kailas, et al., 2001 | He, 2. K/min; Column length: 50. m; Column diameter: 0.2 mm; Tstart: 70. C; Tend: 250. C |
Capillary | PEG-20M | 1282. | Orav and Kann, 2001 | He, 2. K/min; Column length: 50. m; Column diameter: 0.2 mm; Tstart: 70. C; Tend: 220. C |
Capillary | PEG-20M | 1282. | Orav and Kann, 2001 | He, 2. K/min; Column length: 50. m; Column diameter: 0.2 mm; Tstart: 70. C; Tend: 220. C |
Capillary | Innowax | 1290. | Baser, Özek, et al., 2000 | 60. m/0.25 mm/0.25 μm, He, 60. C @ 10. min, 4. K/min, 220. C @ 10. min |
Capillary | DB-Wax | 1278. | Buttery, Light, et al., 2000 | 60. m/0.25 mm/0.25 μm, 30. C @ 4. min, 2. K/min, 170. C @ 30. min |
Capillary | CP-Wax 52CB | 1290. | Chagonda, Makanda, et al., 2000, 2 | 50. m/0.30 mm/0.25 μm, He, 40. C @ 5. min, 3. K/min; Tend: 220. C |
Capillary | DB-Wax | 1271. | Franco and Shibamoto, 2000 | He, 50. C @ 8. min, 3. K/min; Column length: 30. m; Column diameter: 0.2 mm; Tend: 180. C |
Capillary | DB-Wax | 1270. | Franco and Shibamoto, 2000 | He, 50. C @ 8. min, 3. K/min; Column length: 30. m; Column diameter: 0.2 mm; Tend: 180. C |
Capillary | Supelcowax-10 | 1280. | Korány, Mednyánszky, et al., 2000 | 60. m/0.25 mm/0.25 μm, He, 4. K/min; Tstart: 60. C; Tend: 280. C |
Capillary | BP-20 | 1284. | Mallavarapu, Rao, et al., 2000 | 25. m/0.50 mm/0.25 μm, Nitrogen, 5. K/min; Tstart: 60. C; Tend: 200. C |
Capillary | HP-20M | 1260. | Mastelic, Milos, et al., 2000 | 50. m/0.20 mm/0.20 μm, He, 70. C @ 4. min, 4. K/min; Tend: 180. C |
Capillary | DB-Wax | 1294. | Tamura, Boonbumrung, et al., 2000 | Nitrogen, 40. C @ 10. min, 2. K/min; Column length: 60. m; Column diameter: 0.25 mm; Tend: 200. C |
Capillary | DB-Wax | 1279. | Umano, Hagi, et al., 2000 | 60. m/0.25 mm/0.25 μm, He, 40. C @ 2. min, 2. K/min; Tend: 200. C |
Capillary | Supelcowax-10 | 1288. | Choo, Wong, et al., 1999 | 30. m/0.25 mm/0.25 μm, 4. K/min; Tstart: 60. C; Tend: 220. C |
Capillary | BP-20 | 1300. | Dunlop, Bignell, et al., 1999 | 25. m/0.33 mm/0.5 μm, 5. K/min; Tstart: 80. C; Tend: 220. C |
Capillary | Innowax | 1290. | Kaya, Baser, et al., 1999 | 60. m/0.25 mm/0.25 μm, He, 60. C @ 10. min; Tend: 220. C |
Capillary | Supelcowax-10 | 1281. | Labuckas, Zygadlo, et al., 1999 | He, 4. K/min; Column length: 30. m; Column diameter: 0.25 mm; Tstart: 60. C; Tend: 240. C |
Capillary | DB-Wax | 1285. | Ngassoum, Yonkeu, et al., 1999 | 60. m/0.25 mm/0.25 μm, He, 4. K/min; Tstart: 60. C; Tend: 240. C |
Capillary | NB-351 | 1309. | Onocha, Ekundayo, et al., 1999 | 25. m/0.3 mm/0.5 μm, H2, 70. C @ 2. min, 5. K/min; Tend: 250. C |
Capillary | BP-20 | 1268. | Rao, Bhattacharya, et al., 1999 | N2, 5. K/min; Column length: 25. m; Column diameter: 0.5 mm; Tstart: 60. C; Tend: 200. C |
Capillary | DB-Wax | 1280. | Umano, Nakahara, et al., 1999 | 60. m/0.25 mm/0.25 μm, He, 40. C @ 2. min, 2. K/min; Tend: 200. C |
Capillary | BP-20 | 1300. | Bignell, Dunlop, et al., 1998 | 25. m/0.33 mm/0.5 μm, H2, 5. K/min; Tstart: 80. C; Tend: 220. C |
Capillary | HP-20M | 1260. | Milso, Mastelic, et al., 1998 | 50. m/0.2 mm/0.2 μm, He, 70. C @ 4. min, 4. K/min, 180. C @ 10. min |
Capillary | DB-Wax | 1289. | Mölleken, Sinnwell, et al., 1998 | 30. m/0.25 mm/0.25 μm, N2, 3. K/min; Tstart: 45. C; Tend: 220. C |
Capillary | HP-Innowax | 1269. | Ong and Acree, 1998 | 4. K/min; Column length: 25. m; Column diameter: 0.32 mm; Tstart: 35. C; Tend: 250. C |
Capillary | HP-Innowax | 1274. | Stashenko, Cervantes, et al., 1998 | 60. m/0.25 mm/0.25 μm, He, 50. C @ 5. min, 5. K/min; Tend: 220. C |
Capillary | HP-Innowax FSC | 1290. | Tümen, Baser, et al., 1998 | 60. m/0.25 mm/0.25 μm, He, 60. C @ 10. min, 4. K/min, 220. C @ 10. min |
Capillary | HP-Innowax FSC | 1290. | Baser, Kirimer, et al., 1997 | He, 60. C @ 10. min, 4. K/min, 240. C @ 10. min; Column length: 60. m; Column diameter: 0.25 mm |
Capillary | BP-20 | 1300. | Bignell, Dunlop, et al., 1997 | 25. m/0.33 mm/0.5 μm, H2, 5. K/min; Tstart: 80. C; Tend: 220. C |
Capillary | BP-20 | 1300. | Bignell, Dunlop, et al., 1997, 2 | 25. m/0.33 mm/0.5 μm, H2, 5. K/min; Tstart: 80. C; Tend: 220. C |
Capillary | BP-20 | 1300. | Bignell, Dunlop, et al., 1997, 3 | 25. m/0.33 mm/0.5 μm, H2, 5. K/min; Tstart: 80. C; Tend: 220. C |
Capillary | BP-20 | 1300. | Bignell, Dunlop, et al., 1997, 4 | 25. m/0.33 mm/0.5 μm, H2, 5. K/min; Tstart: 80. C; Tend: 220. C |
Capillary | BP-20 | 1300. | Bignell, Dunlop, et al., 1997, 5 | 25. m/0.33 mm/0.5 μm, 5. K/min; Tstart: 80. C; Tend: 220. C |
Capillary | BP-20 | 1300. | Bignell, Dunlop, et al., 1997, 6 | 25. m/0.33 mm/0.5 μm, H2, 5. K/min; Tstart: 80. C; Tend: 220. C |
Capillary | Supelcowax-10 | 1293. | Zygadlo, Ariza-Espinar, et al., 1997 | He, 3. K/min; Column length: 0. m; Column diameter: 0.25 mm; Tstart: 40. C; Tend: 240. C |
Capillary | SP-1000 | 1283. | Brophy, Goldsack, et al., 1996 | He, 3. K/min; Column length: 85. m; Column diameter: 0.50 mm; Tstart: 65. C; Tend: 225. C |
Capillary | PEG-20M | 1281. | Orav, Kailas, et al., 1996 | He, 2. K/min; Column length: 50. m; Column diameter: 0.25 mm; Tstart: 70. C; Tend: 250. C |
Capillary | DB-Wax | 1293. | Sagrero-Nieves and Bartley, 1996 | 60. m/0.32 mm/0.50 μm, He, 50. C @ 1. min, 8. K/min, 250. C @ 6. min |
Capillary | Supelcowax-10 | 1293. | Wong and Lai, 1996 | 60. m/0.25 mm/0.25 μm, He, 40. C @ 3. min, 3. K/min, 200. C @ 30. min |
Capillary | PEG-20M | 1290. | Orav, Kuningas, et al., 1995 | 60. m/0.32 mm/0.25 μm, He, 70. C @ 7. min, 2. K/min; Tend: 180. C |
Capillary | Carbowax 20M | 1291. | Tirado, Stashenko, et al., 1995 | 60. m/0.25 mm/0.25 μm, He, 50. C @ 10. min, 2. K/min, 150. C @ 20. min |
Capillary | Carbowax 20M | 1280. | Kawakami, Kobayashi, et al., 1993 | He, 60. C @ 4. min, 2. K/min; Column length: 50. m; Column diameter: 0.25 mm; Tend: 180. C |
Capillary | DB-Wax | 1282. | Shimoda, Shiratsuchi, et al., 1993 | 60. m/0.25 mm/0.25 μm, He, 50. C @ 4. min, 2. K/min; Tend: 230. C |
Capillary | DB-Wax | 1282. | Shimoda, Shiratsuchi, et al., 1993 | 60. m/0.25 mm/0.25 μm, He, 50. C @ 4. min, 2. K/min; Tend: 230. C |
Capillary | Carbowax 20M | 1287. | Kollmannsberger, Nitz, et al., 1992 | 45. m/0.32 mm/1.0 μm, Hydrogen, 60. C @ 5. min, 2. K/min; Tend: 200. C |
Capillary | Carbowax 20M | 1280. | Kawakami and Kobayashi, 1991 | He, 60. C @ 4. min, 2. K/min; Column length: 50. m; Column diameter: 0.25 mm; Tend: 180. C |
Capillary | DB-Wax | 1297. | Wyllie, Brophy, et al., 1990 | 70. C @ 2. min, 4. K/min; Column length: 30. m; Column diameter: 0.32 mm; Tend: 200. C |
Capillary | FFAP | 1298. | Brophy, Davies, et al., 1989 | 50. C @ 1. min, 10. K/min; Column length: 50. m; Tend: 180. C |
Capillary | DB-Wax | 1281. | Engel, Flath, et al., 1988 | 60. m/0.322 mm/0.25 μm, He, 4. K/min; Tstart: 50. C; Tend: 230. C |
Capillary | Carbowax 20M | 1290. | Buttery, Ling, et al., 1987 | 60. C @ 40. min, 1. K/min; Column length: 150. m; Column diameter: 0.66 mm; Tend: 170. C |
Capillary | Carbowax 20M | 1273. | Shibamoto, 1987 | 2. K/min; Column length: 50. m; Column diameter: 0.25 mm; Tstart: 80. C; Tend: 200. C |
Capillary | Carbowax 20M | 1283. | Nykanen, 1986 | 40. C @ 5. min, 2. K/min; Column length: 25. m; Column diameter: 0.30 mm; Tend: 220. C |
Capillary | BP-20 | 1287. | MacLeod and Snyder, 1985 | 70. C @ 5. min, 3. K/min; Column length: 25. m; Column diameter: 0.2 mm; Tend: 180. C |
Capillary | Carbowax 20M | 1282. | Engel and Tressl, 1983 | 2. K/min; Column length: 50. m; Column diameter: 0.32 mm; Tstart: 70. C; Tend: 180. C |
Capillary | Carbowax 20M | 1290. | Buttery and Kamm, 1980 | 50. C @ 30. min, 1. K/min; Column length: 150. m; Column diameter: 0.64 mm; Tend: 170. C |
Capillary | Carbowax 20M | 1257. | Yamaguchi and Shibamoto, 1980 | N2, 1. K/min; Column length: 50. m; Column diameter: 0.28 mm; Tstart: 80. C; Tend: 170. C |
Capillary | Carbowax 20M | 1257. | Yamaguchi and Shibamoto, 1980 | N2, 1. K/min; Column length: 50. m; Column diameter: 0.28 mm; Tstart: 80. C; Tend: 170. C |
Capillary | Carbowax 20M | 1290. | Shibamoto and Jennings, 1977 | 1. K/min; Column length: 100. m; Column diameter: 0.25 mm; Tstart: 70. C; Tend: 170. C |
Capillary | Carbowax 20M | 1294. | Shibamoto and Jennings, 1977 | 1. K/min; Column length: 100. m; Column diameter: 0.25 mm; Tstart: 70. C; Tend: 170. C |
Packed | Carbowax 20M | 1312. | Stancher and Pertoldi, 1967 | Hydrogen, Gas-Chrom Z (80-100 mesh), 4. K/min; Column length: 2. m; Tstart: 65. C; Tend: 220. C |

Normal alkane RI, polar column, custom temperature program

Column type | Active phase | I | Reference | Comment |
---|---|---|---|---|
Capillary | PEG-20M Innowax | 1277. | Wang, Tian, et al., 2013 | 30. m/0.25 mm/0.25 μm, Nitrogen; Program: 50 0C (7 min) 20 0C/min -> 130 0C (1 min) 1 0C/min -> 150 0C 8 0C/min -> 190 0C (5 min) |
Capillary | Innowax FSC | 1290. | Akin, Saracoglu, et al., 2012 | 60. m/0.25 mm/0.25 μm, Helium; Program: 60 0C (10 min) 4 0C/min -> 220 0C (10 min) 1 oC/min -> 240 0C |
Capillary | Innowax FSC | 1290. | Demirci, Temel, et al., 2011 | 60. m/0.25 mm/0.25 μm, Helium; Program: 60 0C (10 min) 4 0C/min -> 220 0C (10 min) 1 0C/min -> 240 0C |
Capillary | HP Innowax | 1290. | Laribi, Kouki, et al., 2011 | 30. m/0.25 mm/0.25 μm, Nitrogen; Program: 35 0C (10 min) 3 0C/min -> 205 0C 10 0C/min -> 225 0C |
Capillary | DB-Wax | 1282. | Miyazaki, Plotto, et al., 2011 | 60. m/0.25 mm/0.50 μm, Helium; Program: 40 0C 4 0C/min -> 230 0C 100 0C/min -> 260 0C (11.7 min) |
Capillary | Innowax | 1265. | Noorizadeh, Farmany, et al., 2011 | 60. m/0.25 mm/0.33 μm; Program: not specified |
Capillary | HP Innowax | 1265. | Noorizadeh and Farmany, 2010 | 60. m/0.25 mm/0.33 μm; Program: not specified |
Capillary | Innowax FSC | 1290. | Polatoglu, Demirci, et al., 2010 | 60. m/0.25 mm/0.25 μm, Helium; Program: 60 0C (10 min) 4 0C/min -> 220 0C (10 min) 1 0C/min -> 240 0C |
Capillary | Innowax FSC | 1290. | Baser, Demirci, et al., 2009 | 60. m/0.25 mm/0.25 μm, Helium; Program: 60 0C (10 min) 4 0C/min -> 220 0C (10 min) 1 0C/min -> 240 0C |
Capillary | HP Innowax FSP | 1290. | Wedge, Klun, et al., 2009 | 60. m/0.25 mm/0.25 μm, Helium; Program: 60 0C (10 min) 4 0C/min -> 220 0C (10 min) 1 0C/min -> 240 0C (20 min) |
Capillary | Innowax | 1286. | Aicha, Ines, et al., 2008 | 30. m/0.25 mm/0.25 μm, Helium; Program: not specified |
Capillary | CP-Wax 52 CB | 1272. | Kaack and Christensen, 2008 | 50. m/0.25 mm/0.29 μm, Helium; Program: 33 0C (1 min) 2 0C/min -> 130 0C 10 0C/min -> 220 0C |
Capillary | Supelcowax-10 | 1276. | Berard, Bianchi, et al., 2007 | 30. m/0.25 mm/0.25 μm, He; Program: 35C(8min) => 6C/min => 60C => 4C/min => 160C => 20C/min => 200C(1min) |
Capillary | Supelcowax-10 | 1280. | Berard, Bianchi, et al., 2007 | 30. m/0.25 mm/0.25 μm, He; Program: 35C(8min) => 6C/min => 60C => 4C/min => 160C => 20C/min => 200C(1min) |
Capillary | HP-Innowax | 1265. | Formisano, Mignola, et al., 2007 | 50. m/0.2 mm/0.2 μm, He; Program: 40C(5min) => 2C/min => 250C(15min) => 10C/min => 270C |
Capillary | Carbowax 20M | 1291. | Hudaib and Aburjai, 2007 | 30. m/0.25 mm/0.25 μm, He; Program: not specified |
Capillary | Innowax FSC | 1290. | Kaya, Benirci, et al., 2007 | 60. m/0.25 mm/0.25 μm, Nitrogen; Program: 60 0C (10 min) 1 0C/min -> 220 0C (10 min) 1 0C/min -> 240 0C |
Capillary | HP Innowax FSP | 1290. | Tabanca N., Demirci B., et al., 2007 | 60. m/0.25 mm/0.25 μm, N2; Program: 60C(10min) => 4C/min => 220C(10min) => 1C/min => 240C |
Capillary | Innowax FSC | 1290. | Baser, Özek, et al., 2006 | 60. m/0.25 mm/0.25 μm, He; Program: 60C(10min) => 4C/min >220C (10min) => 1C/min => 240C |
Capillary | HP-Innowax FSC | 1290. | Demirci B., Baser K.H.C., et al., 2006 | 60. m/0.25 mm/0.25 μm, N2; Program: 60C(10min) => 4C/min => 220C(10min) => 1C/min => 240C |
Capillary | HP-Innowax FSC | 1290. | Erdurak, Coskun, et al., 2006 | 60. m/0.25 mm/0.25 μm, He; Program: 60C(10min) => 4C/min => 220C (10min) => 1C/min => 240C |
Capillary | HP-Innowax FSC | 1290. | Kürkçüoglu, Hüsnü Can Baser, et al., 2006 | 60. m/0.25 mm/0.25 μm, He; Program: 60C(10min) => 4C/min => 220C (10min) => 1C/min => 240C |
Capillary | HP-Innowax FSC | 1290. | Suleimenov Y.M., Atazhanova G.A., et al., 2006 | 60. m/0.25 mm/0.25 μm, He; Program: 60(10min) => 4C/min => 220C(10min) => 1C/min => 240C |
Capillary | HP-Innowax FSC | 1290. | Tabanca, Demirci, et al., 2006 | 60. m/0.25 mm/0.25 μm, N2; Program: 60C(10min) => 4C/min => 220C => (10min) => 1C/min => 240C |
Capillary | DB-Wax | 1284. | Berlinet, Ducruet, et al., 2005 | 30. m/0.25 mm/0.25 μm, He; Program: not specified |
Capillary | HP-Innowax | 1290. | Demirci, Demirci, et al., 2005 | 60. m/0.25 mm/0.25 μm, N2; Program: 60C(10min) => 4C/min => 220C (10min) => 1C/min => 240C |
Capillary | HP-Innowax FSC | 1290. | Demirci, Demirci, et al., 2005, 2 | 60. m/0.25 mm/0.25 μm, N2; Program: 60C(10min) => 4C/min => 220C (10min) => 1C/min => 240C |
Capillary | CP-Wax 52CB | 1290. | Jales, Maia, et al., 2005 | Hydrogen; Program: not specified |
Capillary | Innowax FSC | 1290. | Kosar, Özek, et al., 2005 | 60. m/0.25 mm/0.25 μm, He; Program: 60C(10min) => 4C/min => 220C(10min) => 1C/min => 240C |
Capillary | HP-Innowax FSC | 1290. | Sezik E., Kocakulak E., et al., 2005 | 60. m/0.25 mm/0.25 μm, He; Program: 60C(10min) => 4C/min => 220C(10min) => 1C/min => 240C |
Capillary | HP-Innowax FSC | 1290. | Tabanca, Demirci, et al., 2005 | 60. m/0.25 mm/0.25 μm, He; Program: 60C(10min) => 4C/min => 220C(10min) => 1C/min => 240C |
Capillary | HP-Innowax FSC | 1290. | Viljoen, Subramoney, et al., 2005 | 60. m/0.25 mm/0.25 μm, He; Program: 60C(10min) => 4C/min => 220C(10min) => 1C/min => 240C |
Capillary | HP-Innowax FSC | 1290. | Demirci, Paper, et al., 2004 | 60. m/0.25 mm/0.25 μm, He; Program: 60C(10min) => 4C/min => 220C(10min) => 1C/min => 240C |
Capillary | HP-Innowax FSC | 1290. | Kivcak, Akay, et al., 2004 | 60. m/0.25 mm/0.25 μm, He; Program: 60C(10min) => 4C/min => 220C(10min) => 1C/min => 240C |
Capillary | HP-Innowax FSC | 1290. | Kivcak, Akay, et al., 2004 | 60. m/0.25 mm/0.25 μm, He; Program: 60C(10min) => 4C/min => 220C(10min) => 1C/min => 240C |
Capillary | Innowax | 1290. | Selli, Kürkçüoglu, et al., 2004 | 60. m/0.25 mm/0.25 μm, He; Program: 50C(10min) => 4C/min => 220C(10min) => 1C/min => 240C |
Capillary | Carbowax 20M | 1286. | Vinogradov, 2004 | Program: not specified |
Capillary | Carbowax 20M | 1287. | Vinogradov, 2004 | Program: not specified |
Capillary | HP-Innowax FSC | 1290. | Demirci, Baser, et al., 2003 | 60. m/0.25 mm/0.25 μm, He; Program: 60C (10min) => 4C/min => 220C (10min) => 1C/min => 240C |
Capillary | HP-Innowax FSC | 1290. | Demirci, Demirci, et al., 2003 | 60. m/0.25 mm/0.25 μm, He; Program: 60C(10min) => 4C/min => 220C(10min) => 1C/min => 240C |
Capillary | Carbowax | 1283. | Edris, Shalaby, et al., 2003 | Program: not specified |
Capillary | HP-Innowax FSC | 1290. | Kaya, Demirci, et al., 2003 | 60. m/0.25 mm/0.25 μm, N2; Program: 60C(10min) => 4C/min => 220C(10min) => 1C/min => 240C |
Capillary | HP-Innowax FSC | 1290. | Kürkcüoglu, Demirci, et al., 2003 | 60. m/0.25 mm/0.25 μm, He; Program: 60C(10min) => 4C/min => 220C(10min) => 1C/min => 240C(40min) |
Capillary | HP-FFAP | 1315. | Mockute and Judzentiene, 2003 | He; Column length: 30. m; Column diameter: 0.25 mm; Program: 60C (2min) => 5C/min => 160C (1min) => 10C/min => 230C (12min) |
Capillary | Innowax | 1290. | Tunaher, Kirimer, et al., 2003 | 60. m/0.25 mm/0.25 μm, He; Program: 60C(10min) => 4C/min => 220C(10min) => 1C/min => 240C (20min) |
Capillary | HP-Innowax | 1290. | Viljoen, van Vuuren, et al., 2003 | 60. m/0.25 mm/0.25 μm; Program: 60C(10min) => 4C/min => 220C(10min) => 1C/min => 240C |
Capillary | HP-Innowax | 1290. | Baser, Demirci, et al., 2002 | 60. m/0.25 mm/0.25 μm, He; Program: 60 0C (10 min) 4 K/min -> 220 0C (10 min) 1 K/min -> 240 0C |
Capillary | Innowax FSC | 1290. | Baser, Demirei, et al., 2002 | 60. m/0.25 mm/0.25 μm, He; Program: 60C(10min) => 4C/min => 220C(10min) => 1C/min => 240C |
Capillary | Innowax | 1290. | Baser, Nuriddinov, et al., 2002 | 60. m/0.25 mm/0.25 μm, He; Program: 60C(10min) => 4C/min => 220C(10min) => 1C/min => 240C |
Capillary | HP-Innowax | 1290. | Demirci, Baser, et al., 2002 | 60. m/0.25 mm/0.25 μm, He; Program: 60 0C (10 min) 4 K/min -> 220 0C (10 min) 1 K/min -> 240 0C |
Capillary | HP-FFAP | 1315. | Mockute and Judzentiene, 2002, 2 | He; Column length: 25. m; Column diameter: 0.22 mm; Program: 60C(2min) => 5C/min => 160C(1min) => 10C/min => 230C(12min) |
Capillary | Innowax FSC | 1290. | Tunalier, Kirimer, et al., 2002 | 60. m/0.25 mm/0.25 μm; Program: 60C(10min) => 4C/min => 220C(10min) => 1C/min => 240C |
Capillary | HP-Innowax | 1290. | Baser, Demirci, et al., 2001 | 60. m/0.25 mm/0.25 μm, He; Program: 60 0C (10 min) 10 K/min -> 220 0C (10 min) 1K/min -> 240 0C |
Capillary | Carbowax 20M | 1292. | Gallori, Bilia, et al., 2001 | H2; Program: not specified |
Capillary | HP-Innowax | 1290. | Gören, Demirci, et al., 2001 | 60. m/0.25 mm/0.25 μm, He; Program: 60 0C (10 min) 4 K/min -> 220 0C (10 min) 1 K/min -> 240 0C |
Capillary | HP-Innowax FSC | 1290. | Kaya, Demirci, et al., 2001 | 60. m/0.25 mm/0.25 μm; Program: 60C(10min) => 4C/min => 220C(10min) => 1C/min => 240C |
Capillary | HP-Innowax FSC | 1290. | Kirimer N., Tabanea N., et al., 2001 | 60. m/0.25 mm/0.25 μm, He; Program: 60C(10min) => 4C/min => 220C(10min) => 1C/min => 240C |
Capillary | Innowax | 1290. | Özcan, Akgül, et al., 2001 | 60. m/0.25 mm/0.25 μm, He; Program: 60C(10min) => 4C/min => 200C(10min) => 1C/min => 240C |
Capillary | Innowax FSC | 1290. | Saglam, Gozler, et al., 2001 | 60. m/0.25 mm/0.25 μm, He; Program: 60C(10min) => 4C/min => 220C(10min) => 1C/min => 240C |
Capillary | Innowax FSC | 1290. | Tabanca N., Demirci F., et al., 2001 | 60. m/0.25 mm/0.25 μm, He; Program: 60C(10min) => 4C/min => 220C(10min) => 1C/min => 240C |
Capillary | HP-Innowax FSC | 1290. | Tabanca, Kirimer, et al., 2001 | 60. m/0.25 mm/0.25 μm; Program: 60C(10min) => 4C/min => 220C(10min) => 1C/min => 240C |
Capillary | HP-Innowax | 1290. | Tabanca, Kirimer, et al., 2001, 2 | 60. m/0.25 mm/0.25 μm, He; Program: 60C(10min) => 4C/min => 220C(10min) => 1C/min => 240C |
Capillary | FFAP | 1257. | Tucker, Maciarello, et al., 2001 | 50. m/0.2 mm/0.33 μm; Program: 60C(1min) => 2.5C/min => 115C => 1C/min => 210C(30min) |
Capillary | HP-Wax | 1280. | Usubillaga, Aparicio, et al., 2001 | 60. m/0.25 mm/0.25 μm, He; Program: 50 0C 3 K/min -> 200 0C 8 K/min -> 280 0C |
Capillary | Innowax | 1290. | Baser, Özek, et al., 2000, 2 | 60. m/0.25 mm/0.25 μm, He; Program: 60 0C (10 min) 4 K/min -> 220 0C (10 min) 1 K/min -> 240 0C |
Capillary | Innowax | 1290. | Baser, Özek, et al., 2000, 3 | 60. m/0.25 mm/0.25 μm, He; Program: 60 0C (10 min) 4 K/min -> 220 0C (10 min) 1 K/min -> 240 0C |
Capillary | Innowax | 1290. | Baser, Tabanca, et al., 2000 | 60. m/0.25 mm/0.25 μm, He; Program: 60 0C (10 min) 4 K/min -> 220 0C (10 min) 1 K/min -> 240 0C |
Capillary | Innowax FSC | 1290. | Kirimer, Tabanca, et al., 2000 | 60. m/0.25 mm/0.25 μm, He; Program: 60C(10 min) => 4C/min => 220C(10min) => 1C/min => 240C |
Capillary | Supelcowax-10 | 1281. | Zunino, Lopez, et al., 2000 | Program: not specified |
Capillary | HP-Innowax FSC | 1290. | Bagci, Baser, et al., 1999 | 60. m/0.25 mm/0.25 μm, He; Program: 60C(10min) => 4C/min => 220C(10min) => 1C/min => 240C |
Capillary | Innowax FSC | 1290. | Kirimer, Tabanca, et al., 1999 | 60. m/0.25 mm/0.25 μm, Helium; Program: 60 0C (10 min) 4 0C/min -> 220 0C (10 min) 1 0C/min -> 240 0C |
Capillary | FFAP | 1269. | Reddy, Angers, et al., 1998 | 25. m/0.2 mm/0.33 μm, H2; Program: 40C(5min) => 4C/min => 170C => 8C/min => 240C (12min) |
Capillary | Supelcowax 10 | 1274. | Castioni and Kapetanidis, 1996 | 60. m/0.25 mm/0.25 μm, Helium; Program: 60 0C (10 min) 2 0C/min -> 80 0C 3 0C/min -> 100 0C 4 0C/min -> 220 0C (30 min) |
Capillary | Supelcowax 10 | 1288. | Castioni and Kapetanidis, 1996 | 60. m/0.25 mm/0.25 μm, Helium; Program: not specified |
Capillary | Supelcowax 10 | 1288. | Castioni and Kapetanidis, 1996 | 60. m/0.25 mm/0.25 μm, Helium; Program: not specified |
Capillary | Carbowax 20M | 1291. | Tirado, Stashenko, et al., 1995 | 60. m/0.25 mm/0.25 μm, He; Program: not specified |
Capillary | NB-351 | 1276. | Kerrola and Kallio, 1994 | 25. m/0.32 mm/0.2 μm, He; Program: 35C(5min) => 2.5C/min => 150C => 5C/min => 240C (20min) |
Capillary | NB-351 | 1268. | Kerrola and Kallio, 1993 | 25. m/0.32 mm/0.2 μm; Program: 40C(5min) => 4C/min => 150C => 8C/min => 240C(12min) |
Capillary | CP-Wax 52CB | 1285. | Vernin, 1991 | Column length: 50. m; Column diameter: 0.32 mm; Program: not specified |

References

Stephenson and Malanowski, 1987
Stephenson, Richard M.; Malanowski, Stanislaw,
Handbook of the Thermodynamics of Organic Compounds, 1987, https://doi.org/10.1007/978-94-009-3173-2
. [all data]
Stull, 1947
Stull, Daniel R.,
Vapor Pressure of Pure Substances. Organic and Inorganic Compounds,
Ind. Eng. Chem., 1947, 39, 4, 517-540, https://doi.org/10.1021/ie50448a022
. [all data]
Bukala, Majewski, et al., 1954
Bukala, M.; Majewski, J.; Rodzinski, W.,
Przem. Chem., 1954, 10, 6. [all data]
Pickett and Peterson, 1929
Pickett, O.A.; Peterson, J.M.,
Terpenes and Terpene Alcohols. I. Vapor Pressure-Temperature Relationships,
Ind. Eng. Chem., 1929, 21, 4, 325-326, https://doi.org/10.1021/ie50232a013
. [all data]