2,2,3,4,4-pentamethyl-3-pentanol
- Formula: C10H22O
- Molecular weight: 158.2811
- IUPAC Standard InChIKey: UYFZQUABCZILAI-UHFFFAOYSA-N
- CAS Registry Number: 5857-69-2
- Chemical structure:
View 3d structure (requires JavaScript / HTML 5) - Permanent link for this species. Use this link for bookmarking this species for future reference.

Phase change data

Data compiled by: Thermodynamics Research Center, NIST Boulder Laboratories, Chris Muzny director
Quantity | Value | Units | Method | Reference | Comment |
---|---|---|---|---|---|
Tboil | 467.55 | K | N/A | Howard, Mears, et al., 1947 | Uncertainty assigned by TRC = 0.4 K |
Tboil | 460.65 | K | N/A | Conant and Blatt, 1929 | Uncertainty assigned by TRC = 6. K |
Quantity | Value | Units | Method | Reference | Comment |
Tfus | 311. | K | N/A | Petrov, Sokolova, et al., 1960 | Uncertainty assigned by TRC = 3. K |
Tfus | 315.25 | K | N/A | Howard, Mears, et al., 1947 | Uncertainty assigned by TRC = 0.2 K |

References

Howard, Mears, et al., 1947
Howard, F.L.; Mears, T.W.; Fookson, A.; Pomerantz, P.; Brooks, D.B.,
Preparation and physical properties of several aliphatic hydrocarbons and intermediates,
J. Res. Natl. Bur. Stand. (U. S.), 1947, 38, 365. [all data]
Conant and Blatt, 1929
Conant, J.B.; Blatt, A.H.,
J. Am. Chem. Soc., 1929, 51, 1227. [all data]
Petrov, Sokolova, et al., 1960
Petrov, A.D.; Sokolova, E.B.; Kao, C.L.,
Reaction of tert-Butyllithium with Esters of Acids,
Zh. Obshch. Khim., 1960, 30, 1107. [all data]