Benzene, (1-bromoethyl)-
- Formula: C8H9Br
- Molecular weight: 185.061
- IUPAC Standard InChIKey: CRRUGYDDEMGVDY-UHFFFAOYSA-N
- CAS Registry Number: 585-71-7
- Chemical structure:
View 3d structure (requires JavaScript / HTML 5) - Stereoisomers:
- Other names: α-Methylbenzyl bromide; α-Phenethyl bromide; α-Phenylethyl bromide; (α-Bromoethyl)benzene; (1-Bromoethyl)benzene; 1-Bromo-1-phenylethane; 1-Phenethyl bromide; 1-Phenyl-1-bromoethane; 1-Phenylethyl bromide; NSC 8052

Phase change data

Data compiled as indicated in comments:
BS - Robert L. Brown and Stephen E. Stein
AC - William E. Acree, Jr., James S. Chickos
Quantity | Value | Units | Method | Reference | Comment |
---|---|---|---|---|---|
ΔvapH° | 56.4 ± 0.3 | kJ/mol | GS | Krasnykh, Vasiltsova, et al., 2002 | Based on data from 298. to 333. K.; AC |
ΔvapH° | 52.4 | kJ/mol | CGC | Krasnykh, Vasiltsova, et al., 2002 | AC |
Reduced pressure boiling point
Tboil (K) | Pressure (bar) | Reference | Comment |
---|---|---|---|
367.2 | 0.021 | Aldrich Chemical Company Inc., 1990 | BS |
367. | 0.021 | Farchan Laboratories, 1990 | BS |

Reaction thermochemistry data

Data compiled by: Hussein Y. Afeefy, Joel F. Liebman, and Stephen E. Stein
Individual Reactions
By formula: HBr + C8H8 = C8H9Br
Quantity | Value | Units | Method | Reference | Comment |
---|---|---|---|---|---|
ΔrH° | -69.0 ± 7.1 | kJ/mol | Cm | Nesterova, Kovzel, et al., 1977 | liquid phase; Hydrobromination |

Normal alkane RI, non-polar column, temperature ramp

Column type | Active phase | I | Reference | Comment |
---|---|---|---|---|
Capillary | SE-30 | 1139. | Krasnykh, Vasiltsova, et al., 2002 | Nitrogen, 30. C @ 5. min, 10. K/min; Column length: 25. m; Tend: 250. C |

References

Krasnykh, Vasiltsova, et al., 2002
Krasnykh, Eugen L.; Vasiltsova, Tatiana V.; Verevkin, Sergey P.; Heintz, Andreas,
Vapor Pressures and Enthalpies of Vaporization of Benzyl Halides and Benzyl Ethers,
J. Chem. Eng. Data, 2002, 47, 6, 1372-1378, https://doi.org/10.1021/je020034h
. [all data]
Aldrich Chemical Company Inc., 1990
Aldrich Chemical Company Inc.,
Catalog Handbook of Fine Chemicals, Aldrich Chemical Company, Inc., Milwaukee WI, 1990, 1. [all data]
Farchan Laboratories, 1990
Farchan Laboratories,
Research Chemicals Catalog, Farchan Laboratories, Gainesville, FL, 1990, 91. [all data]
Nesterova, Kovzel, et al., 1977
Nesterova, T.N.; Kovzel, E.N.; Karaseva, S.Ya.; Rozhnov, A.M.,
Heats of reaction of the hydrohalogenation of styrene and α-methylstyrene,
Vses. Konf. Kalorim. Rasshir. Tezisy Dokl. 7th, 1977, 1, 132. [all data]