2-methylbutanoyl chloride

Phase change data

Data compiled by: Thermodynamics Research Center, NIST Boulder Laboratories, Chris Muzny director

Quantity Value Units Method Reference Comment
Tboil374.KN/ACason and Chang, 1956Uncertainty assigned by TRC = 3. K

In addition to the Thermodynamics Research Center (TRC) data available from this site, much more physical and chemical property data is available from the following TRC products:

References

Cason and Chang, 1956
Cason, J.; Chang, M.P., Condensation of Acrylonitrile with Unsymmetrical Ketones, J. Org. Chem., 1956, 21, 449. [all data]