Pyridine, 2,6-bis(1,1-dimethylethyl)-
- Formula: C13H21N
- Molecular weight: 191.3125
- IUPAC Standard InChIKey: UWKQJZCTQGMHKD-UHFFFAOYSA-N
- CAS Registry Number: 585-48-8
- Chemical structure:
View 3d structure (requires JavaScript / HTML 5) - Other names: 2,6-di-tert-Butylpyridine; 2,6-di-t-Butylpyridine; Pyridine, 2,6-di-tert-butyl-; 2,6-(t-C4H9)2-pyridine

Phase change data

Data compiled as indicated in comments:
BS - Robert L. Brown and Stephen E. Stein
AC - William E. Acree, Jr., James S. Chickos
Quantity | Value | Units | Method | Reference | Comment |
---|---|---|---|---|---|
ΔvapH° | 56.6 ± 1.2 | kJ/mol | N/A | Freitas, Acree, et al., 2008 | AC |
Reduced pressure boiling point
Tboil (K) | Pressure (bar) | Reference | Comment |
---|---|---|---|
373.7 | 0.031 | Aldrich Chemical Company Inc., 1990 | BS |

Reaction thermochemistry data

Data compiled by: Michael M. Meot-Ner (Mautner) and Sharon G. Lias
Individual Reactions
By formula: C13H22N+ + C13H21N = (C13H22N+ • C13H21N)
Quantity | Value | Units | Method | Reference | Comment |
---|---|---|---|---|---|
ΔrH° | 96. | kJ/mol | PHPMS | Meot-Ner M. and Sieck, 1983 | gas phase; (H), DG<, ΔrS> |
Quantity | Value | Units | Method | Reference | Comment |
ΔrS° | 250. | J/mol*K | PHPMS | Meot-Ner M. and Sieck, 1983 | gas phase; (H), DG<, ΔrS> |
Free energy of reaction
ΔrG° (kJ/mol) | T (K) | Method | Reference | Comment |
---|---|---|---|---|
19. | 313. | PHPMS | Meot-Ner M. and Sieck, 1983 | gas phase; (H), DG<, ΔrS> |

Gas phase ion energetics data

Data evaluated by: Edward P. Hunter and Sharon G. Lias
Quantity | Value | Units | Method | Reference | Comment |
---|---|---|---|---|---|
Proton affinity (review) | 982.9 | kJ/mol | N/A | Hunter and Lias, 1998 | |
Quantity | Value | Units | Method | Reference | Comment |
Gas basicity | 951. | kJ/mol | N/A | Hunter and Lias, 1998 |

Ion clustering data

Data compiled by: Michael M. Meot-Ner (Mautner) and Sharon G. Lias
Clustering reactions
By formula: C13H22N+ + C13H21N = (C13H22N+ • C13H21N)
Quantity | Value | Units | Method | Reference | Comment |
---|---|---|---|---|---|
ΔrH° | 96. | kJ/mol | PHPMS | Meot-Ner M. and Sieck, 1983 | gas phase; (H), DG<, ΔrS> |
Quantity | Value | Units | Method | Reference | Comment |
ΔrS° | 250. | J/mol*K | PHPMS | Meot-Ner M. and Sieck, 1983 | gas phase; (H), DG<, ΔrS> |
Free energy of reaction
ΔrG° (kJ/mol) | T (K) | Method | Reference | Comment |
---|---|---|---|---|
19. | 313. | PHPMS | Meot-Ner M. and Sieck, 1983 | gas phase; (H), DG<, ΔrS> |

References

Freitas, Acree, et al., 2008
Freitas, Vera L.S.; Acree, William E.; da Silva, Maria D.M.C. Ribeiro,
Thermochemical Study of Three Hindered Pyridine Derivatives,
J. Chem. Eng. Data, 2008, 53, 8, 1820-1823, https://doi.org/10.1021/je800155q
. [all data]
Aldrich Chemical Company Inc., 1990
Aldrich Chemical Company Inc.,
Catalog Handbook of Fine Chemicals, Aldrich Chemical Company, Inc., Milwaukee WI, 1990, 1. [all data]
Meot-Ner M. and Sieck, 1983
Meot-Ner M.; Sieck, L.W.,
The Ionic Hydrogen Bond. 1. Sterically Hindered Bonds. Solvation and Clustering of Sterically Hindered Amines and Pyridines,
J. Am. Chem. Soc., 1983, 105, 10, 2956, https://doi.org/10.1021/ja00348a005
. [all data]
Hunter and Lias, 1998
Hunter, E.P.; Lias, S.G.,
Evaluated Gas Phase Basicities and Proton Affinities of Molecules: An Update,
J. Phys. Chem. Ref. Data, 1998, 27, 3, 413-656, https://doi.org/10.1063/1.556018
. [all data]