Benzene, 2-methyl-1,4-bis(1-methylethyl)-
- Formula: C13H20
- Molecular weight: 176.2979
- IUPAC Standard InChIKey: BRXCOIOOGGCKPZ-UHFFFAOYSA-N
- CAS Registry Number: 58502-85-5
- Chemical structure:
View 3d structure (requires JavaScript / HTML 5) - Other names: 1,4-Diisopropyl-2-methylbenzene

Normal alkane RI, non-polar column, temperature ramp

Column type | Active phase | I | Reference | Comment |
---|---|---|---|---|
Capillary | OV-1 | 1210. | Hu, Liang, et al., 2010 | 30. m/0.25 mm/0.25 μm, Helium, 50. C @ 3. min, 5. K/min, 250. C @ 2. min |

References

Hu, Liang, et al., 2010
Hu, C.-D.; Liang, Y.-Z.; Guo, F.-Q.; Li, X.-R.; Wang, W.-P.,
Determination of essential oil composition from Osmanthus fragrans tea by GC-MS combined with a chemometric resolution method,
Molecules, 2010, 15, 5, 3683-3693, https://doi.org/10.3390/molecules15053683
. [all data]