(l,l)-cis-3,6-Dimethylpiperazine-2,5-dione
- Formula: C6H10N2O2
- Molecular weight: 142.1558
- IUPAC Standard InChIKey: WWISPHBAYBECQZ-QWWZWVQMSA-N
- CAS Registry Number: 5845-61-4
- Chemical structure:
View 3d structure (requires JavaScript / HTML 5) - Stereoisomers:

Condensed phase thermochemistry data

Data compiled by: Hussein Y. Afeefy, Joel F. Liebman, and Stephen E. Stein
Quantity | Value | Units | Method | Reference | Comment |
---|---|---|---|---|---|
ΔcH°solid | -3292.8 ± 0.3 | kJ/mol | Ccb | Wrede, 1911 |

Reaction thermochemistry data

Data compiled by: Hussein Y. Afeefy, Joel F. Liebman, and Stephen E. Stein
Individual Reactions
By formula: C6H10N2O2 = C6H10N2O2
Quantity | Value | Units | Method | Reference | Comment |
---|---|---|---|---|---|
ΔrH° | 0.9 ± 0.4 | kJ/mol | Eqk | Eguchi and Kakuta, 1974 | liquid phase; solvent: Ethanol/base |

References

Wrede, 1911
Wrede, F.,
Uber die Bestimmung von Berbrennungswarmen mittels der kalorimetrischen Bombe unter Benutzung des Platinwiderstandsthermometers,
Z. Phys. Chem. (Leipzig), 1911, 81-94. [all data]
Eguchi and Kakuta, 1974
Eguchi, C.; Kakuta, A.,
Studies on cyclic dipeptides. I. Thermodynamics of the cis-trans isomerization of the side chains in cyclic dipeptides,
J. Am. Chem. Soc., 1974, 96, 3985-3989. [all data]