Hexane, 1,2,5,6-tetrabromo-
- Formula: C6H10Br4
- Molecular weight: 401.760
- IUPAC Standard InChIKey: WPBWUVCMCYXPFI-UHFFFAOYSA-N
- CAS Registry Number: 58443-86-0
- Chemical structure:
View 3d structure (requires JavaScript / HTML 5) - Other names: 1,2,5,6-Tetrabromohexane

Phase change data

Data compiled by: Thermodynamics Research Center, NIST Boulder Laboratories, Chris Muzny director
Quantity | Value | Units | Method | Reference | Comment |
---|---|---|---|---|---|
Tfus | 322.65 | K | N/A | Pomerantz, Fookson, et al., 1954 | Uncertainty assigned by TRC = 2. K |

References

Pomerantz, Fookson, et al., 1954
Pomerantz, P.; Fookson, A.; Mears, T.W.; Rothberg, S.; Howard, F.L.,
Synthesis and Physical Properties of Several Acetylenic Hydrocarbons,
J. Res. Natl. Bur. Stand. (U. S.), 1954, 52, 51. [all data]