potassium carbonate

Condensed phase thermochemistry data

Quantity Value Units Method Reference Comment
Δfliquid-1130.61kJ/molReviewChase, 1998Data last reviewed in March, 1966
Quantity Value Units Method Reference Comment
liquid,1 bar170.44J/mol*KReviewChase, 1998Data last reviewed in March, 1966
Quantity Value Units Method Reference Comment
Δfsolid-1150.18kJ/molReviewChase, 1998Data last reviewed in March, 1966
Quantity Value Units Method Reference Comment
solid155.44J/mol*KReviewChase, 1998Data last reviewed in March, 1966

Liquid Phase Heat Capacity (Shomate Equation)

Cp° = A + B*t + C*t2 + D*t3 + E/t2
H° − H°298.15= A*t + B*t2/2 + C*t3/3 + D*t4/4 − E/t + F − H
S° = A*ln(t) + B*t + C*t2/2 + D*t3/3 − E/(2*t2) + G
    Cp = heat capacity (J/mol*K)
    H° = standard enthalpy (kJ/mol)
    S° = standard entropy (J/mol*K)
    t = temperature (K) / 1000.

View plot Requires a JavaScript / HTML 5 canvas capable browser.

View table.

Temperature (K) 1174. - 2500.
A 209.2000
B -1.629015×10-7
C 8.009850×10-8
D -1.336428×10-8
E -2.105289×10-8
F -1225.548
G 355.0417
H -1130.609
ReferenceChase, 1998
Comment Data last reviewed in March, 1966

Solid Phase Heat Capacity (Shomate Equation)

Cp° = A + B*t + C*t2 + D*t3 + E/t2
H° − H°298.15= A*t + B*t2/2 + C*t3/3 + D*t4/4 − E/t + F − H
S° = A*ln(t) + B*t + C*t2/2 + D*t3/3 − E/(2*t2) + G
    Cp = heat capacity (J/mol*K)
    H° = standard enthalpy (kJ/mol)
    S° = standard entropy (J/mol*K)
    t = temperature (K) / 1000.

View plot Requires a JavaScript / HTML 5 canvas capable browser.

View table.

Temperature (K) 298. - 1174.
A 97.08093
B 94.22326
C -2.053291
D 0.709644
E -0.947860
F -1186.499
G 239.5834
H -1150.182
ReferenceChase, 1998
Comment Data last reviewed in March, 1966

References

Chase, 1998
Chase, M.W., Jr., NIST-JANAF Themochemical Tables, Fourth Edition, J. Phys. Chem. Ref. Data, Monograph 9, 1998, 1-1951. [all data]