3-Methyl-2,5-oxazolidine-dione
- Formula: C4H5NO3
- Molecular weight: 115.0874
- IUPAC Standard InChIKey: PMPAXURTFMSZSN-UHFFFAOYSA-N
- CAS Registry Number: 5840-76-6
- Chemical structure:
View 3d structure (requires JavaScript / HTML 5) - Other names: N-Methyloxazole, 2,5-dione

Condensed phase thermochemistry data

Data compiled by: Hussein Y. Afeefy, Joel F. Liebman, and Stephen E. Stein
Quantity | Value | Units | Method | Reference | Comment |
---|---|---|---|---|---|
ΔfH°solid | -600.4 ± 2.9 | kJ/mol | Ccb | Breitenbach, Derkosch, et al., 1952 | Reanalyzed by Cox and Pilcher, 1970, Original value = -598.7 kJ/mol |
Quantity | Value | Units | Method | Reference | Comment |
ΔcH°solid | -1688.2 ± 2.9 | kJ/mol | Ccb | Breitenbach, Derkosch, et al., 1952 | Reanalyzed by Cox and Pilcher, 1970, Original value = -1689. kJ/mol |

References

Breitenbach, Derkosch, et al., 1952
Breitenbach, J.W.; Derkosch, J.; Wessely, F.,
Energetik der bildung hochmolekularer polypeptide,
Monatsh. Chem., 1952, 83, 591. [all data]
Cox and Pilcher, 1970
Cox, J.D.; Pilcher, G.,
Thermochemistry of Organic and Organometallic Compounds, Academic Press, New York, 1970, 1-636. [all data]