1,2-Butanediol
- Formula: C4H10O2
- Molecular weight: 90.1210
- IUPAC Standard InChIKey: BMRWNKZVCUKKSR-UHFFFAOYSA-N
- CAS Registry Number: 584-03-2
- Chemical structure:
View 3d structure (requires JavaScript / HTML 5) - Species with the same structure:
- Other names: 1,2-Butylene glycol; α-Butylene glycol; Ethylethylene glycol; 1,2-(Dihydroxy)butane; Butane-1,2-diol; DL-1,2-Butanediol; 1,2-Butandiol; NSC 24242

Condensed phase thermochemistry data

Data compiled by: Hussein Y. Afeefy, Joel F. Liebman, and Stephen E. Stein
Quantity | Value | Units | Method | Reference | Comment |
---|---|---|---|---|---|
ΔfH°liquid | -523.8 | kJ/mol | Ccb | Moureu and Dode, 1937 | |
Quantity | Value | Units | Method | Reference | Comment |
ΔcH°liquid | -2479. | kJ/mol | Ccb | Moureu and Dode, 1937 | Corresponding ΔfHºliquid = -523.8 kJ/mol (simple calculation by NIST; no Washburn corrections) |

Phase change data

Data compiled by: Thermodynamics Research Center, NIST Boulder Laboratories, Chris Muzny director
Quantity | Value | Units | Method | Reference | Comment |
---|---|---|---|---|---|
Tboil | 463.65 | K | N/A | Mellan, 1962 | Uncertainty assigned by TRC = 1. K |
Tboil | 463.65 | K | N/A | Clendenning, Macdonald, et al., 1950 | Uncertainty assigned by TRC = 1. K |
Tboil | 469.65 | K | N/A | Henninger, 1886 | Uncertainty assigned by TRC = 2. K |
Tboil | 456.65 | K | N/A | Wurtz, 1859 | Uncertainty assigned by TRC = 6. K |

Kovats' RI, non-polar column, isothermal

Column type | Active phase | Temperature (C) | I | Reference | Comment |
---|---|---|---|---|---|
Packed | Apiezon L | 160. | 809. | Bogoslovsky, Anvaer, et al., 1978 | Celite 545 |

Van Den Dool and Kratz RI, non-polar column, temperature ramp

Column type | Active phase | I | Reference | Comment |
---|---|---|---|---|
Capillary | DB-1 | 812.8 | Sun and Stremple, 2003 | 30. m/0.25 mm/0.25 μm, He, 3. K/min; Tstart: 40. C; Tend: 325. C |

Normal alkane RI, non-polar column, custom temperature program

Column type | Active phase | I | Reference | Comment |
---|---|---|---|---|
Capillary | DB-5 | 766. | da Fonseca, Bizerra, et al., 2009 | 30. m/0.25 mm/0.25 μm, Hydrogen; Program: 35 0C 4 0C/min -> 180 0C 17 0C/min -> 280 0C (10 min) |

Normal alkane RI, polar column, temperature ramp

Column type | Active phase | I | Reference | Comment |
---|---|---|---|---|
Capillary | FFAP | 1563. | Nebesny, Budryn, et al., 2007 | 30. m/0.32 mm/0.5 μm, N2, 35. C @ 5. min, 4. K/min, 320. C @ 45. min |

References

Moureu and Dode, 1937
Moureu, H.; Dode, M.,
Chaleurs de formation de l'oxyde d'ethylene, de l'ethanediol et de quelques homologues,
Bull. Soc. Chim. France, 1937, 4, 637-647. [all data]
Mellan, 1962
Mellan, I.,
Polyhydric Alcohols, Spartan Books: Washington, DC, 1962. [all data]
Clendenning, Macdonald, et al., 1950
Clendenning, K.A.; Macdonald, F.J.; Wright, D.E.,
Effects of position isomerism on the physical properties of glycols,
Can. J. Res., Sect. B, 1950, 28, 608-22. [all data]
Henninger, 1886
Henninger, A.,
Several Derivatives of Erythritol and Formates of Polyatomic Alcohols,
Ann. Chim. Phys., 1886, [6] 7, 209. [all data]
Wurtz, 1859
Wurtz, A.,
Ann. Chim. Phys., 1859, 55, 400. [all data]
Bogoslovsky, Anvaer, et al., 1978
Bogoslovsky, Yu.N.; Anvaer, B.I.; Vigdergauz, M.S.,
Chromatographic constants in gas chromatography (in Russian), Standards Publ. House, Moscow, 1978, 192. [all data]
Sun and Stremple, 2003
Sun, G.; Stremple, P.,
Retention index characterization of flavor, fragrance, and many other compounds on DB-1 and DB-XLB, 2003, retrieved from http://www.chem.agilent.com/cag/cabu/pdf/b-0279.pdf. [all data]
da Fonseca, Bizerra, et al., 2009
da Fonseca, A.M.; Bizerra, A.M.C.; de Souza, J.S.N.; Monte, F.J.Q.; de Oliveira M.C.F.; de Mattos, M.C.; Cordell, G.A.; Braz-Filho, R.; Lemos, T.L.G.,
Constituents and antioxidant activity of two varieties of coconut water (Cocos nucifera L.),
Braz. J. Pharmacognosy, 2009, 19, 1B, 193-198. [all data]
Nebesny, Budryn, et al., 2007
Nebesny, E.; Budryn, G.; Kula, J.; Majda, T.,
The effect of roasting method on headspace composition of robusta coffee bean aroma,
Eur. Food Res. Technol., 2007, 225, 1, 9-19, https://doi.org/10.1007/s00217-006-0375-0
. [all data]