Benzene, 4-bromo-1,2-dimethyl-
- Formula: C8H9Br
- Molecular weight: 185.061
- IUPAC Standard InChIKey: QOGHRLGTXVMRLM-UHFFFAOYSA-N
- CAS Registry Number: 583-71-1
- Chemical structure:
View 3d structure (requires JavaScript / HTML 5) - Other names: o-Xylene, 4-bromo-; 1-Bromo-3,4-dimethylbenzene; 3,4-Dimethylbromobenzene; 3,4-Xylyl bromide; 4-Bromo-o-xylene; 4-Bromo-1,2-dimethylbenzene; 4-Bromo-1,2-xylene; 4-Bromo-ortho-xylene; 3,4-Dimethylphenyl bromide

Phase change data

Data compiled by: Robert L. Brown and Stephen E. Stein
Quantity | Value | Units | Method | Reference | Comment |
---|---|---|---|---|---|
Tboil | 487.7 | K | N/A | Weast and Grasselli, 1989 | |
Tboil | 479. to 481. | K | N/A | Buckingham and Donaghy, 1982 | |
Quantity | Value | Units | Method | Reference | Comment |
Tfus | 272.9 | K | N/A | Buckingham and Donaghy, 1982 |

References

Weast and Grasselli, 1989
CRC Handbook of Data on Organic Compounds, 2nd Editon, Weast,R.C and Grasselli, J.G., ed(s)., CRC Press, Inc., Boca Raton, FL, 1989, 1. [all data]
Buckingham and Donaghy, 1982
Buckingham, J.; Donaghy, S.M.,
Dictionary of Organic Compounds: Fifth Edition, Chapman and Hall, New York, 1982, 1. [all data]