Chloropropylate
- Formula: C17H16Cl2O3
- Molecular weight: 339.213
- IUPAC Standard InChIKey: AXGUBXVWZBFQGA-UHFFFAOYSA-N
- CAS Registry Number: 5836-10-2
- Chemical structure:
View 3d structure (requires JavaScript / HTML 5) - Other names: Benzeneacetic acid, 4-chloro-α-(4-chlorophenyl)-α-hydroxy-, 1-methylethyl ester; Benzilic acid, 4,4'-dichloro-, isopropyl ester; Acaralate; ENT 26,999; Isopropyl 4,4'-Dichlorobenzilate; Rospan; Rospin; Rospine; Chlormite; Chlorpropylat; G 24,163; GEIGY 24163; Gesakur; Isopropylester kyseliny 4,4'-dichlorbenzilove; 1-Methylethyl 4-chloro-α-(4-chlorophenyl)-α-hydroxybenzeneacetate; Chlorpropylate

Phase change data

Data compiled by: Thermodynamics Research Center, NIST Boulder Laboratories, Chris Muzny director
Quantity | Value | Units | Method | Reference | Comment |
---|---|---|---|---|---|
Tfus | 345. | K | N/A | Plato, 1972 | Uncertainty assigned by TRC = 0.2 K |

Normal alkane RI, non-polar column, custom temperature program

Column type | Active phase | I | Reference | Comment |
---|---|---|---|---|
Capillary | Ultra-1 | 2189. | Tameo and Kiyos, 1991 | Program: not specified |

Normal alkane RI, polar column, custom temperature program

Column type | Active phase | I | Reference | Comment |
---|---|---|---|---|
Capillary | Carbowax 20M | 3337. | Tameo and Kiyos, 1991 | Program: not specified |

References

Plato, 1972
Plato, C.,
DSC as a general method for determining purity and heat of fusion of high-purity organic chemicals,
Anal. Chem., 1972, 44, 1531. [all data]
Tameo and Kiyos, 1991
Tameo, O.; Kiyos, I.,
Simultaneous determination of pesticides by capillary gas chromatography,
Cannot be traslated (in Japan), 1991, 14, 2, 109-122. [all data]