Cyclohexanol, 2-methyl-
- Formula: C7H14O
- Molecular weight: 114.1855
- IUPAC Standard InChIKey: NDVWOBYBJYUSMF-UHFFFAOYSA-N
- CAS Registry Number: 583-59-5
- Chemical structure:
View 3d structure (requires JavaScript / HTML 5) - Stereoisomers:
- Other names: 1-Methyl-2-cyclohexanol; 2-Methyl-1-cyclohexanol; 2-Methylcyclohexanol; o-Methylcyclohexanol; Cyclohexanol, o-methyl-; NSC 75845; 2-Methylcyclohexyl alcohol; 2-methylcyclohexanol, mixed isomers

Condensed phase thermochemistry data

Data compiled as indicated in comments:
ALS - Hussein Y. Afeefy, Joel F. Liebman, and Stephen E. Stein
DH - Eugene S. Domalski and Elizabeth D. Hearing
Quantity | Value | Units | Method | Reference | Comment |
---|---|---|---|---|---|
ΔcH°liquid | -1046.9 | kcal/mol | Ccb | Zubova, 1901 | Corresponding ΔfHºliquid = -89.7 kcal/mol (simple calculation by NIST; no Washburn corrections); ALS |
Constant pressure heat capacity of liquid
Cp,liquid (cal/mol*K) | Temperature (K) | Reference | Comment |
---|---|---|---|
63.920 | 298.15 | Caceres-Alonso, Costas, et al., 1988 | Mixed isomers. Cp(trans isomer) = 262.98; (cis isomer) = 268.95 J/mol*K.; DH |
47.71 | 290. | Herz and Bloch, 1924 | DH |

Phase change data

Data compiled as indicated in comments:
BS - Robert L. Brown and Stephen E. Stein
TRC - Thermodynamics Research Center, NIST Boulder Laboratories, Chris Muzny director
AC - William E. Acree, Jr., James S. Chickos
Quantity | Value | Units | Method | Reference | Comment |
---|---|---|---|---|---|
Tboil | 437.7 | K | N/A | Aldrich Chemical Company Inc., 1990 | BS |
Tboil | 441.65 | K | N/A | Lecat, 1930 | Uncertainty assigned by TRC = 0.5 K; not clear that this is a new measurement; TRC |
Tboil | 440.7 | K | N/A | Von Auwers, Hinterseber, et al., 1915 | Uncertainty assigned by TRC = 1. K; TRC |
Quantity | Value | Units | Method | Reference | Comment |
ΔvapH° | 15.1 | kcal/mol | CGC | Chickos, Hosseini, et al., 1995 | Based on data from 323. to 373. K.; AC |
Enthalpy of vaporization
ΔvapH (kcal/mol) | Temperature (K) | Method | Reference | Comment |
---|---|---|---|---|
12.4 | 376. | EB | Palczewska-Tulinska and Oracz, 2007 | Based on data from 361. to 439. K.; AC |

Reaction thermochemistry data

Data compiled by: Hussein Y. Afeefy, Joel F. Liebman, and Stephen E. Stein
Individual Reactions
By formula: H2 + C7H12O = C7H14O
Quantity | Value | Units | Method | Reference | Comment |
---|---|---|---|---|---|
ΔrH° | -15.86 | kcal/mol | Chyd | Dokuchaeva, Sibarov, et al., 1981 | liquid phase |

Kovats' RI, non-polar column, isothermal

Column type | Active phase | Temperature (C) | I | Reference | Comment |
---|---|---|---|---|---|
Packed | Apiezon L | 120. | 946. | Bogoslovsky, Anvaer, et al., 1978 | Celite 545 |
Packed | Apiezon L | 160. | 973. | Bogoslovsky, Anvaer, et al., 1978 | Celite 545 |

Van Den Dool and Kratz RI, non-polar column, custom temperature program

Column type | Active phase | I | Reference | Comment |
---|---|---|---|---|
Capillary | Methyl Silicone | 941. | Peng, Yang, et al., 1991 | Program: not specified |
Packed | SE-30 | 941. | Peng, Ding, et al., 1988 | Supelcoport; Chromosorb; Column length: 3.05 m; Program: 40C(5min) => 10C/min => 200C or 250C (60min) |

References

Zubova, 1901
Zubova, P.,
Data about heat of combustion of compound cycle structure,
Zh. Fiz. Khim., 1901, 33, 708-722. [all data]
Caceres-Alonso, Costas, et al., 1988
Caceres-Alonso, M.; Costas, M.; Andreoli-Ball, L.; Patterson, D.,
Steric effects on the self-association of branched and cyclic alcohols in inert solvents. Apparent heat capacities of secondary and tertiary alcohols in hydrocarbons,
Can. J. Chem., 1988, 66, 989-998. [all data]
Herz and Bloch, 1924
Herz, W.; Bloch, W.,
Physikalisch-chemische Untersuchungen an Verbindungen der Cyklohexanreihe,
Z. Phys. Chem., 1924, 110, 23-39. [all data]
Aldrich Chemical Company Inc., 1990
Aldrich Chemical Company Inc.,
Catalog Handbook of Fine Chemicals, Aldrich Chemical Company, Inc., Milwaukee WI, 1990, 1. [all data]
Lecat, 1930
Lecat, M.,
Azeotropism in Binary Mixtures Containing an Alcohol Mixed with an amine, a nitro derivative, an ether or water.,
Z. Anorg. Allg. Chem., 1930, 186, 119. [all data]
Von Auwers, Hinterseber, et al., 1915
Von Auwers, K.; Hinterseber, R.; Treppman, W.,
Concerning Simple Hydroaromatic Hydrocarbons, Alcohols and Ketones,
Justus Liebigs Ann. Chem., 1915, 410, 257-287. [all data]
Chickos, Hosseini, et al., 1995
Chickos, James S.; Hosseini, Sarah; Hesse, Donald G.,
Determination of vaporization enthalpies of simple organic molecules by correlations of changes in gas chromatographic net retention times,
Thermochimica Acta, 1995, 249, 41-62, https://doi.org/10.1016/0040-6031(95)90670-3
. [all data]
Palczewska-Tulinska and Oracz, 2007
Palczewska-Tulinska, Marcela; Oracz, Pawel,
Vapor-Liquid Equilibria in the 2-Methylcyclohexanol + 2-Methylcyclohexyl Ethanoate System at 101.325 kPa,
J. Chem. Eng. Data, 2007, 52, 2, 645-649, https://doi.org/10.1021/je600559q
. [all data]
Dokuchaeva, Sibarov, et al., 1981
Dokuchaeva, T.G.; Sibarov, d.A.; Timofeev, V.F.; Proskuryakov, V.A.,
Kinetics of the dehydrogenation of 2-methylcyclohexanol to 2-methylcyclohexanone over a platinum catalyst,
J. Appl. Chem. USSR, 1981, 54, 1140-1146. [all data]
Bogoslovsky, Anvaer, et al., 1978
Bogoslovsky, Yu.N.; Anvaer, B.I.; Vigdergauz, M.S.,
Chromatographic constants in gas chromatography (in Russian), Standards Publ. House, Moscow, 1978, 192. [all data]
Peng, Yang, et al., 1991
Peng, C.T.; Yang, Z.C.; Maltby, D.,
Prediction of retention indexes. III. Silylated derivatives of polar compounds,
J. Chromatogr., 1991, 586, 1, 113-129, https://doi.org/10.1016/0021-9673(91)80029-G
. [all data]
Peng, Ding, et al., 1988
Peng, C.T.; Ding, S.F.; Hua, R.L.; Yang, Z.C.,
Prediction of Retention Indexes I. Structure-Retention Index Relationship on Apolar Columns,
J. Chromatogr., 1988, 436, 137-172, https://doi.org/10.1016/S0021-9673(00)94575-8
. [all data]