Benzene, 1-bromo-2-iodo-
- Formula: C6H4BrI
- Molecular weight: 282.904
- IUPAC Standard InChIKey: OIRHKGBNGGSCGS-UHFFFAOYSA-N
- CAS Registry Number: 583-55-1
- Chemical structure:
View 3d structure (requires JavaScript / HTML 5) - Other names: o-Bromoiodobenzene; 1-Bromo-2-iodobenzene; 2-Bromoiodobenzene

Condensed phase thermochemistry data

Data compiled by: Eugene S. Domalski and Elizabeth D. Hearing
Constant pressure heat capacity of liquid
Cp,liquid (J/mol*K) | Temperature (K) | Reference | Comment |
---|---|---|---|
179.9 | 298.15 | Narbutt, 1918 | T = 195 to 373 K. Cp = 0.15285 + 0.0001332t. Cp value calculated from equation. |

Phase change data

Data compiled as indicated in comments:
BS - Robert L. Brown and Stephen E. Stein
TRC - Thermodynamics Research Center, NIST Boulder Laboratories, Chris Muzny director
AC - William E. Acree, Jr., James S. Chickos
DH - Eugene S. Domalski and Elizabeth D. Hearing
Quantity | Value | Units | Method | Reference | Comment |
---|---|---|---|---|---|
Tfus | 275.25 | K | N/A | Narbutt, 1918, 2 | Uncertainty assigned by TRC = 0.5 K; TRC |
Reduced pressure boiling point
Tboil (K) | Pressure (bar) | Reference | Comment |
---|---|---|---|
530.2 | 1.01 | Weast and Grasselli, 1989 | BS |
393.7 | 0.020 | Weast and Grasselli, 1989 | BS |
393. | 0.020 | American Tokyo Kasei, 1988 | BS |
Enthalpy of fusion
ΔfusH (kJ/mol) | Temperature (K) | Reference | Comment |
---|---|---|---|
14.42 | 294.2 | Acree, 1991 | AC |
14.441 | 275.25 | Narbutt, 1918 | DH |
Entropy of fusion
ΔfusS (J/mol*K) | Temperature (K) | Reference | Comment |
---|---|---|---|
52.5 | 275.25 | Narbutt, 1918 | DH |

Van Den Dool and Kratz RI, non-polar column, temperature ramp

Column type | Active phase | I | Reference | Comment |
---|---|---|---|---|
Capillary | OV-1 | 1300.0 | Gautzsch and Zinn, 1996 | 8. K/min; Tstart: 35. C; Tend: 300. C |
Capillary | OV-1 | 1300.0 | Gautzsch and Zinn, 1996 | 8. K/min; Tstart: 35. C; Tend: 300. C |

References

Narbutt, 1918
Narbutt, J.,
Die Spezifischen Warmen und Schmelzwarmen der dichloro-, chlorbrom-, dibrom-, bromjod-, und dijodbenzole. I,
Z. Elektrochem., 1918, 24, 339-342. [all data]
Narbutt, 1918, 2
Narbutt, J.,
The specific heats and heats of melting of dichlorobenzene, bromochlorobenzene, dibromobenzene, bromiodobenzene and diiodobenzenes: I,
Z. Elektrochem. Angew. Phys. Chem., 1918, 24, 339-42. [all data]
Weast and Grasselli, 1989
CRC Handbook of Data on Organic Compounds, 2nd Editon, Weast,R.C and Grasselli, J.G., ed(s)., CRC Press, Inc., Boca Raton, FL, 1989, 1. [all data]
American Tokyo Kasei, 1988
American Tokyo Kasei,
TCI American Organic Chemical 88/89 Catalog, American Tokyo Kasei, Portland, OR, 1988, 1610. [all data]
Acree, 1991
Acree, William E.,
Thermodynamic properties of organic compounds: enthalpy of fusion and melting point temperature compilation,
Thermochimica Acta, 1991, 189, 1, 37-56, https://doi.org/10.1016/0040-6031(91)87098-H
. [all data]