Acetophenone phenylhydrazone
- Formula: C14H14N2
- Molecular weight: 210.2744
- IUPAC Standard InChIKey: CPSCIFXVLXCFIQ-NTCAYCPXSA-N
- CAS Registry Number: 583-11-9
- Chemical structure:
View 3d structure (requires JavaScript / HTML 5) - Permanent link for this species. Use this link for bookmarking this species for future reference.

Condensed phase thermochemistry data

Data compiled by: Hussein Y. Afeefy, Joel F. Liebman, and Stephen E. Stein
Quantity | Value | Units | Method | Reference | Comment |
---|---|---|---|---|---|
ΔfH°solid | -49.8 | kJ/mol | Ccb | Landrieu, 1905 | |
Quantity | Value | Units | Method | Reference | Comment |
ΔcH°solid | -7460. | kJ/mol | Ccb | Landrieu, 1905 |

References

Landrieu, 1905
Landrieu, M.Ph.,
Thermochimie. - Thermochimie des hydrazones,
Compt. Rend., 1905, 141, 358-361. [all data]
Ramart-Lucas and Martynoff, 1947
Ramart-Lucas, P.; Martynoff, M.,
Bull. soc. chim. France, 1947, [5] 14, 986. [all data]