Benzoic acid, 2-propenyl ester
- Formula: C10H10O2
- Molecular weight: 162.1852
- IUPAC Standard InChIKey: LYJHVEDILOKZCG-UHFFFAOYSA-N
- CAS Registry Number: 583-04-0
- Chemical structure:

Phase change data

Data compiled by: Thermodynamics Research Center, NIST Boulder Laboratories, Chris Muzny director
Quantity | Value | Units | Method | Reference | Comment |
---|---|---|---|---|---|
Tboil | 502.9 | K | N/A | Perkin, 1896 | Uncertainty assigned by TRC = 1.5 K |

Kovats' RI, non-polar column, isothermal

Column type | Active phase | Temperature (C) | I | Reference | Comment |
---|---|---|---|---|---|
Capillary | SE-30 | 140. | 1254. | Korhonen, 1986 | N2; Column length: 25. m; Column diameter: 0.22 mm |
Capillary | SE-30 | 160. | 1221. | Korhonen, 1986 | N2; Column length: 25. m; Column diameter: 0.22 mm |
Capillary | SE-30 | 180. | 1263. | Korhonen, 1986 | N2; Column length: 25. m; Column diameter: 0.22 mm |
Capillary | SE-30 | 140. | 1241. | Korhonen and Lind, 1985 | |
Capillary | SE-30 | 160. | 1248. | Korhonen and Lind, 1985 | |
Capillary | SE-30 | 200. | 1260. | Korhonen and Lind, 1985 |

Kovats' RI, polar column, isothermal

Column type | Active phase | Temperature (C) | I | Reference | Comment |
---|---|---|---|---|---|
Capillary | OV-351 | 180. | 1834. | Korhonen, 1986 | N2; Column length: 25. m; Column diameter: 0.22 mm |
Capillary | OV-351 | 140. | 1820. | Korhonen and Lind, 1985 | N2; Column length: 25. m; Column diameter: 0.32 mm |
Capillary | OV-351 | 160. | 1836. | Korhonen and Lind, 1985 | N2; Column length: 25. m; Column diameter: 0.32 mm |
Capillary | OV-351 | 180. | 1848. | Korhonen and Lind, 1985 | N2; Column length: 25. m; Column diameter: 0.32 mm |

Van Den Dool and Kratz RI, non-polar column, temperature ramp

Column type | Active phase | I | Reference | Comment |
---|---|---|---|---|
Capillary | SE-30 | 1239. | Korhonen and Lind, 1985 | 10. K/min; Tstart: 100. C; Tend: 280. C |
Capillary | SE-30 | 1231. | Korhonen and Lind, 1985 | 2. K/min; Tstart: 100. C; Tend: 280. C |
Capillary | SE-30 | 1236. | Korhonen and Lind, 1985 | 6. K/min; Tstart: 100. C; Tend: 280. C |
Capillary | SE-30 | 1238. | Korhonen, 1985 | N2, 6. K/min; Column length: 25. m; Column diameter: 0.33 mm; Tstart: 100. C |

Van Den Dool and Kratz RI, polar column, temperature ramp

Column type | Active phase | I | Reference | Comment |
---|---|---|---|---|
Capillary | OV-351 | 1791. | Korhonen, 1986 | N2, 6. K/min; Column length: 25. m; Column diameter: 0.22 mm; Tstart: 100. C; Tend: 220. C |
Capillary | OV-351 | 1828. | Korhonen and Lind, 1985 | N2, 10. K/min; Column length: 25. m; Column diameter: 0.32 mm; Tstart: 100. C; Tend: 230. C |
Capillary | OV-351 | 1806. | Korhonen and Lind, 1985 | N2, 2. K/min; Column length: 25. m; Column diameter: 0.32 mm; Tstart: 100. C; Tend: 230. C |
Capillary | OV-351 | 1805. | Korhonen and Lind, 1985 | N2, 6. K/min; Column length: 25. m; Column diameter: 0.32 mm; Tstart: 100. C; Tend: 230. C |
Capillary | OV-351 | 1808. | Korhonen, 1985 | N2, 6. K/min; Column length: 25. m; Column diameter: 0.32 mm; Tstart: 100. C |

Normal alkane RI, non-polar column, temperature ramp

Column type | Active phase | I | Reference | Comment |
---|---|---|---|---|
Capillary | HP-1 | 1230. | Castel, Fernandez, et al., 2006 | 50. m/0.2 mm/0.5 μm, He, 2. K/min, 250. C @ 120. min; Tstart: 60. C |
Capillary | HP-1 | 1230. | Castel, Fernandez, et al., 2006 | 50. m/0.2 mm/0.33 μm, He, 60. C @ 4. min, 2. K/min, 250. C @ 30. min |
Capillary | HP-1 | 1232. | Fernandez, Lizzani-Cuvelier, et al., 2003 | 50. m/0.2 mm/0.5 μm, He, 2. K/min, 220. C @ 45. min; Tstart: 60. C |
Capillary | SE-30 | 1243. | Korhonen, 1986 | N2, 6. K/min; Column length: 25. m; Column diameter: 0.22 mm; Tstart: 100. C |

Normal alkane RI, non-polar column, custom temperature program

Column type | Active phase | I | Reference | Comment |
---|---|---|---|---|
Capillary | Squalane | 1254. | Chen, 2008 | Program: not specified |
Capillary | SE-30 | 1239. | Vinogradov, 2004 | Program: not specified |

Normal alkane RI, polar column, temperature ramp

Column type | Active phase | I | Reference | Comment |
---|---|---|---|---|
Capillary | PEG-20M | 1802. | Narain, Almeida, et al., 2004 | 50. m/0.20 mm/0.20 μm, 40. C @ 5. min, 3. K/min, 180. C @ 30. min |

Normal alkane RI, polar column, custom temperature program

Column type | Active phase | I | Reference | Comment |
---|---|---|---|---|
Capillary | Carbowax 20M | 1800. | Vinogradov, 2004 | Program: not specified |

References

Perkin, 1896
Perkin, W.H.,
LXIX. On Magnetic Rotatory Power, especially of Aromatic Compounds,
J. Chem. Soc., 1896, 69, 1025-1257. [all data]
Korhonen, 1986
Korhonen, I.O.O.,
Gas-Liquid Chromatographic Analyses. XLVII. Retention Increments of Some Lower Saturated Branched-Chain, Unsaturated and Chlorinated Esters of Benzoic, 4-Nitrobenzoic and 3,5-Dinitrobenzoic Acids on SE-30 and OV-351 Capillary Columns,
J. Chromatogr., 1986, 360, 63-78, https://doi.org/10.1016/S0021-9673(00)91652-2
. [all data]
Korhonen and Lind, 1985
Korhonen, I.O.O.; Lind, M.A.,
Gas-liquid chromatographic analyses. XXXVIII. Capillary column studies of unsaturated esters of benzoic and monochlorobenzoic acids,
J. Chromatogr., 1985, 324, 113-127, https://doi.org/10.1016/S0021-9673(01)81311-X
. [all data]
Korhonen, 1985
Korhonen, I.O.O.,
Gas-liquid chromatographic analyses. XLIV. Benzoyl and pentafluorobenzoyl esters of lower saturated branched-chain and unsaturated alcohols on SE-30 and OV-351 capillary columns,
J. Chromatogr., 1985, 329, 359-369, https://doi.org/10.1016/S0021-9673(01)81942-7
. [all data]
Castel, Fernandez, et al., 2006
Castel, C.; Fernandez, X.; Lizzani-Cuvelier, L.; Perichet, C.; Lavoine, S.,
Characterization of the Chemical Composition of a Byproduct from Siam Benzoin Gum,
J. Agric. Food Chem., 2006, 54, 23, 8848-8854, https://doi.org/10.1021/jf061193y
. [all data]
Fernandez, Lizzani-Cuvelier, et al., 2003
Fernandez, X.; Lizzani-Cuvelier, L.; Loiseau, A.-M.; Périchet, C.; Delbecque, C.,
Volatile constituents of benzoin gums: Siam and Sumatra. Part 1.,
Flavour Fragr. J., 2003, 18, 4, 328-333, https://doi.org/10.1002/ffj.1230
. [all data]
Chen, 2008
Chen, H.-F.,
Quantitative prediction of gas chromatography retention indices with support vector machines, radial basis neutral networks and multiple linear regression,
Anal. Chim. Acta, 2008, 609, 1, 24-36, https://doi.org/10.1016/j.aca.2008.01.003
. [all data]
Vinogradov, 2004
Vinogradov, B.A.,
Production, composition, properties and application of essential oils, 2004, retrieved from http://viness.narod.ru. [all data]
Narain, Almeida, et al., 2004
Narain, N.; Almeida, J.N.; Galvão, M.S.; Madruga, M.S.; de Brito, E.S.,
Volatile compounds in passion fruit (Passiflora edulis forma Flavicarpa) and yellow mombin (Spondias mombin L.) fruits obtained by dynamic headspace technique,
Cienc. Tecnol. Aliment. Campinas, 2004, 24, 2, 212-216, https://doi.org/10.1590/S0101-20612004000200009
. [all data]