N,N-Dimethylhexanamide
- Formula: C8H17NO
- Molecular weight: 143.2267
- IUPAC Standard InChIKey: OAERLTPBKQBWHJ-UHFFFAOYSA-N
- CAS Registry Number: 5830-30-8
- Chemical structure:
View 3d structure (requires JavaScript / HTML 5) - Other names: Hexanamide, N,N-dimethyl-; N,N-Dimethylcaproamide

Phase change data

Data compiled by: Robert L. Brown and Stephen E. Stein
Reduced pressure boiling point
Tboil (K) | Pressure (bar) | Reference |
---|---|---|
408. to 409. | 0.0033 | Frinton Laboratories Inc., 1986 |

Gas phase ion energetics data

Data compiled by: Michael M. Meot-Ner (Mautner)
Gas basicity at 298K
Gas basicity (review) (kJ/mol) | Reference | Comment |
---|---|---|
898. ± 5. | Witt and Grutzmacher, 1997 | Pyridine. GB upper limit. Data readjusted to Hunter and Lias, 1998 |

References

Frinton Laboratories Inc., 1986
Frinton Laboratories Inc.,
Catalog Number 11, Frinton Laboratories Inc., Vineland, NJ, 1986, 99. [all data]
Witt and Grutzmacher, 1997
Witt, M.; Grutzmacher, H.F.,
Proton-bound dimers of aliphatic carboxamides: gas-phase basicity and dissociation energy,
Int. J. Mass Spectrom. Ion Processes, 1997, 165, 49. [all data]
Hunter and Lias, 1998
Hunter, E.P.; Lias, S.G.,
Evaluated Gas Phase Basicities and Proton Affinities of Molecules: An Update,
J. Phys. Chem. Ref. Data, 1998, 27, 3, 413-656, https://doi.org/10.1063/1.556018
. [all data]