Dimethyl-5-norbornene-2,3-dicarboxylate
- Formula: C11H14O4
- Molecular weight: 210.2265
- IUPAC Standard InChIKey: VGQLNJWOULYVFV-WZENYGAOSA-N
- CAS Registry Number: 5826-73-3
- Chemical structure:
View 3d structure (requires JavaScript / HTML 5) - Stereoisomers:
- Other names: Dimethyl bicyclo[2.2.1]-5-heptene-2,3-dicarboxylate; Bicyclo(2,2,1)hept-5-ene-2,3-dicarboxylic acid, dimethyl ester; 3,6-Endomethylene-Δ4-tetrahydrophthalic acid dimethylester; Bicyclo(2.2.1)hept-5-ene-2,3-dicarboxylic acid, dimethyl ester; Compound 3,916; Dimalone; Dimelone; Dimethyl carbate; Dimethyl 5-bicyclo(2.2.1)hepten-2,3-dicarboxylate; NISY; 5-Norbornene-2,3-dicarboxylic acid, dimethyl ester; Compound-3916; Dimethylester kyseliny bicyklo(2,2,1)hept-5-en-2,3-dikarboxylove; Dimethylkarbat; Bicyclo[2.2.1]hept-2-ene-5,6-dicarboxylic acid, dimethyl ester; NSC 7326

Phase change data

Data compiled by: Robert L. Brown and Stephen E. Stein
Reduced pressure boiling point
Tboil (K) | Pressure (bar) | Reference |
---|---|---|
423. to 425. | 0.027 | Frinton Laboratories Inc., 1986 |

Kovats' RI, non-polar column, isothermal

Column type | Active phase | Temperature (C) | I | Reference | Comment |
---|---|---|---|---|---|
Capillary | Ultra-1 | 125. | 1413. | Herrmann, Dufka, et al., 1986 | 25. m/0.20 mm/0.32 μm, N2 |
Capillary | Ultra-1 | 150. | 1423. | Herrmann, Dufka, et al., 1986 | 25. m/0.20 mm/0.32 μm, N2 |
Capillary | Ultra-1 | 175. | 1434. | Herrmann, Dufka, et al., 1986 | 25. m/0.20 mm/0.32 μm, N2 |
Capillary | Ultra-1 | 200. | 1445. | Herrmann, Dufka, et al., 1986 | 25. m/0.20 mm/0.32 μm, N2 |

References

Frinton Laboratories Inc., 1986
Frinton Laboratories Inc.,
Catalog Number 11, Frinton Laboratories Inc., Vineland, NJ, 1986, 99. [all data]
Herrmann, Dufka, et al., 1986
Herrmann, F.; Dufka, O.; Churacek, J.,
Fused-Silica Capillary Gas Chromatography-Mass Spectrometry of Some Dicarboxylic Acids Present in Condensation-Type Polymers I. Dimethyl Esters,
J. Chromatogr., 1986, 360, 79-88, https://doi.org/10.1016/S0021-9673(00)91653-4
. [all data]