Benzoic acid, 3-amino-, ethyl ester
- Formula: C9H11NO2
- Molecular weight: 165.1891
- IUPAC Standard InChIKey: ZMCBYSBVJIMENC-UHFFFAOYSA-N
- CAS Registry Number: 582-33-2
- Chemical structure:
View 3d structure (requires JavaScript / HTML 5) - Other names: Benzoic acid, m-amino-, ethyl ester; m-Aminobenzoic acid, ethyl ester; m-Ethoxycarbonylaniline; Ethyl m-aminobenzoate; Ethyl 3-aminobenzoate; 3-(Ethoxycarbonyl)aniline

Phase change data

Data compiled by: Robert L. Brown and Stephen E. Stein
Quantity | Value | Units | Method | Reference | Comment |
---|---|---|---|---|---|
Tboil | 567.2 | K | N/A | Weast and Grasselli, 1989 | |
Tboil | 567. | K | N/A | Buckingham and Donaghy, 1982 |
Reduced pressure boiling point
Tboil (K) | Pressure (bar) | Reference |
---|---|---|
446.7 | 0.017 | Aldrich Chemical Company Inc., 1990 |
417. | 0.007 | Buckingham and Donaghy, 1982 |

References

Weast and Grasselli, 1989
CRC Handbook of Data on Organic Compounds, 2nd Editon, Weast,R.C and Grasselli, J.G., ed(s)., CRC Press, Inc., Boca Raton, FL, 1989, 1. [all data]
Buckingham and Donaghy, 1982
Buckingham, J.; Donaghy, S.M.,
Dictionary of Organic Compounds: Fifth Edition, Chapman and Hall, New York, 1982, 1. [all data]
Aldrich Chemical Company Inc., 1990
Aldrich Chemical Company Inc.,
Catalog Handbook of Fine Chemicals, Aldrich Chemical Company, Inc., Milwaukee WI, 1990, 1. [all data]