Testosterone
- Formula: C19H28O2
- Molecular weight: 288.4244
- IUPAC Standard InChIKey: MUMGGOZAMZWBJJ-JZJKZLICSA-N
- CAS Registry Number: 58-22-0
- Chemical structure:
View 3d structure (requires JavaScript / HTML 5) - Stereoisomers:
- Other names: Androst-4-en-3-one, 17-hydroxy-, (17β)-; Δ4-Androsten-17β-ol-3-one; Androlin; Andronaq; Andrusol; Cristerona T; Geno-cristaux Gremy; Homosteron; Homosterone; Mertestate; Neotestis; Orquisteron; Perandren; Percutacrine androgenique; Primotest; Primoteston; Sustanon; Sustanone; Teslen; Testandrone; Testiculosterone; Testobase; Testopropon; Testosteroid; Testosteron; Testoviron Schering; Testoviron T; Testrone; Testryl; Virormone; Virosterone; 4-Androsten-17β-ol-3-one; trans-Testosterone; Androst-4-en-17β-ol-3-one; Androst-4-en-3-one, 17β-hydroxy-; Malerone; Malogen, aquaspension injection; Neo-Hombreol F; Oreton; Oreton F; Synandrol F; Testoviron; 17β-Hydroxy-Δ4-androsten-3-one; 17β-Hydroxy-4-androsten-3-one; 17β-Hydroxyandrost-4-en-3-one; 17-Hydroxy-(17β)-androst-4-en-3-one; Cristerone T; Andro 100; Testoderm; Testolin; Testro AQ; 17-Hydroxyandrost-4-en-3-one, (17β)-; 4-Androsten-3-one, 17b-hydroxy-; 17Beta-hydroxyandrost-4-en-3-one; Androst-4-en-3-on-17b-ol; 17β-Testosterone; 4-Androsten-3-one-17β-ol; AndroGel; COL 1621; Intrinsa; Relibra; Striant; Testogel; Testim; component of Di-Genik (Salt/Mix); component of Di-Met (Salt/Mix); component of Duogen (Salt/Mix); component of Mal-O-Fem (Salt/Mix); component of Intrinsa (Salt/Mix); component of Tostrex (Salt/Mix)

Condensed phase thermochemistry data

Data compiled by: Hussein Y. Afeefy, Joel F. Liebman, and Stephen E. Stein
Quantity | Value | Units | Method | Reference | Comment |
---|---|---|---|---|---|
ΔcH°solid | -2649. ± 7. | kcal/mol | Ccb | Paoli, Garrigues, et al., 1969 | Corresponding ΔfHºsolid = -94. kcal/mol (simple calculation by NIST; no Washburn corrections) |

Phase change data

Data compiled as indicated in comments:
TRC - Thermodynamics Research Center, NIST Boulder Laboratories, Chris Muzny director
AC - William E. Acree, Jr., James S. Chickos
Quantity | Value | Units | Method | Reference | Comment |
---|---|---|---|---|---|
Tfus | 429. | K | N/A | Grady, Hays, et al., 1973 | Uncertainty assigned by TRC = 1. K; TRC |
Enthalpy of fusion
ΔfusH (kcal/mol) | Temperature (K) | Method | Reference | Comment |
---|---|---|---|---|
6.74 | 426.5 | DSC | Wassvik, Holmén, et al., 2006 | AC |
7.039 | 428. | N/A | Regosz, Chmielewska, et al., 1994 | AC |

Kovats' RI, non-polar column, isothermal

View large format table.

Column type Active phase Temperature (C) I Reference Comment
PackedOV-1230.2602.Quilliam and Westmore, 1978Gas Chrom Q; Column length: 1. m

Van Den Dool and Kratz RI, non-polar column, temperature ramp

View large format table.

Column type Active phase I Reference Comment
PackedSE-302620.Perrigo and Peel, 1981N2, Chromosorb W, 130. C @ 2. min, 8. K/min, 290. C @ 8. min; Column length: 1.8 m

Normal alkane RI, non-polar column, custom temperature program

View large format table.

Column type Active phase I Reference Comment
OtherMethyl Silicone2620.Ardrey and Moffat, 1981Program: not specified

References

Paoli, Garrigues, et al., 1969
Paoli, D.; Garrigues, J.-C.; Patin, H.,
Combustion microcalorimetry: application to steroids,
C. R. Acad. Sci. Paris, 1969, 268, 780-783. [all data]
Grady, Hays, et al., 1973
Grady, L.T.; Hays, S.E.; King, R.H.; Klein, H.R.; Mader, W.J.; Wyatt, D.K.; Zimmere, R.O.,
Drug purity profiles,
J. Pharm. Sci., 1973, 62, 459. [all data]
Wassvik, Holmén, et al., 2006
Wassvik, Carola M.; Holmén, Anders G.; Bergström, Christel A.S.; Zamora, Ismael; Artursson, Per,
Contribution of solid-state properties to the aqueous solubility of drugs,
European Journal of Pharmaceutical Sciences, 2006, 29, 3-4, 294-305, https://doi.org/10.1016/j.ejps.2006.05.013
. [all data]
Regosz, Chmielewska, et al., 1994
Regosz, A.; Chmielewska, A.; Pelplinska, T.; Kowalski, P.,
Prediction of the solubility of steroid hormones,
Pharmazie, 1994, 49, 5, 371. [all data]