Naphthalene, 1-(1-cyclopenten-1-yl)-
- Formula: C15H14
- Molecular weight: 194.2717
- IUPAC Standard InChIKey: IQHWZOGRTZTFDB-UHFFFAOYSA-N
- CAS Registry Number: 58195-37-2
- Chemical structure:
View 3d structure (requires JavaScript / HTML 5) - Other names: 1-(1-cyclopenten-1-yl)-naphthalene

Lee's RI, non-polar column, temperature ramp

Column type | Active phase | I | Reference | Comment |
---|---|---|---|---|
Capillary | HP-5 | 281.62 | Piao, Chu, et al., 1999 | 30. m/0.25 mm/0.25 μm, 50. C @ 2. min, 4. K/min, 280. C @ 20. min |

References

Piao, Chu, et al., 1999
Piao, M.; Chu, S.; Zheng, M.; Xu, X.,
Characterization of the combustion products of polyethylene,
Chemosphere, 1999, 39, 9, 1497-1512, https://doi.org/10.1016/S0045-6535(99)00054-5
. [all data]