Co(CO)
- Formula: CCoO
- Molecular weight: 86.9433
- CAS Registry Number: 58168-84-6

Reaction thermochemistry data

Data compiled by: John E. Bartmess
Individual Reactions
+ CCoO = C6H5CoO-
By formula: C5H5- + CCoO = C6H5CoO-
Quantity | Value | Units | Method | Reference | Comment |
---|---|---|---|---|---|
ΔrH° | 42.7 ± 3.3 | kJ/mol | N/A | Sunderlin and Squires, 1999 | gas phase |

Ion clustering data

Data compiled by: John E. Bartmess
Clustering reactions
+ CCoO = C6H5CoO-
By formula: C5H5- + CCoO = C6H5CoO-
Quantity | Value | Units | Method | Reference | Comment |
---|---|---|---|---|---|
ΔrH° | 42.7 ± 3.3 | kJ/mol | N/A | Sunderlin and Squires, 1999 | gas phase |

Vibrational and/or electronic energy levels

Data compiled by: Marilyn E. Jacox

State:   X

Vib.
sym.
 No.   Approximate
 type of mode
 cm-1   Med.   Method   References

Σ+ 1 CO stretch 1974.17 gas DL Ikeda, Hikida, et al., 2008
1 CO stretch 1973.9 Ne IR Zhou and Andrews, 1999
1 CO stretch 1960.7 Ar IR Hanlan, Huber, et al., 1975
Zhou and Andrews, 1998
Tremblay, Alikhani, et al., 2001
1 CO stretch 1957.3 vs Ar IR Hanlan, Huber, et al., 1975
Zhou and Andrews, 1998
Tremblay, Alikhani, et al., 2001
1 CO stretch 1952 Kr IR Hanlan, Huber, et al., 1975
1 CO stretch 1944 Kr IR Hanlan, Huber, et al., 1975
1 CO stretch 1947 Xe IR Hanlan, Huber, et al., 1975
1 CO stretch 1941 Xe IR Hanlan, Huber, et al., 1975
Π 2 Bend 424.9 w Ar IR Tremblay, Alikhani, et al., 2001
Σ+ 3 CoC stretch 579.2 w Ar IR Tremblay, Alikhani, et al., 2001

Additional references: Jacox, 1998, page 167; Jacox, 2003, page 67

References

Sunderlin and Squires, 1999
Sunderlin, L.S.; Squires, R.R.,
Bond strengths in cyclopentadienyl metal carbonyl anions,
Int. J. Mass Spectrom., 1999, 183, 149-161, https://doi.org/10.1016/S1387-3806(98)14230-6
. [all data]