Benzal diacetate
- Formula: C11H12O4
- Molecular weight: 208.2106
- IUPAC Standard InChIKey: XRYSDRCNTMEYFH-UHFFFAOYSA-N
- CAS Registry Number: 581-55-5
- Chemical structure:

Gas phase thermochemistry data

Data compiled by: Hussein Y. Afeefy, Joel F. Liebman, and Stephen E. Stein
Quantity | Value | Units | Method | Reference | Comment |
---|---|---|---|---|---|
ΔfH°gas | -676.85 ± 0.99 | kJ/mol | Ccb | Verevkin, Peng, et al., 1996 |

Condensed phase thermochemistry data

Data compiled by: Hussein Y. Afeefy, Joel F. Liebman, and Stephen E. Stein
Quantity | Value | Units | Method | Reference | Comment |
---|---|---|---|---|---|
ΔfH°solid | -773.02 ± 0.57 | kJ/mol | Ccb | Verevkin, Peng, et al., 1996 | |
Quantity | Value | Units | Method | Reference | Comment |
ΔcH°solid | -5270.56 ± 0.57 | kJ/mol | Ccb | Verevkin, Peng, et al., 1996 | Corresponding ΔfHºsolid = -773.03 kJ/mol (simple calculation by NIST; no Washburn corrections) |

Phase change data

Data compiled as indicated in comments:
ALS - Hussein Y. Afeefy, Joel F. Liebman, and Stephen E. Stein
DRB - Donald R. Burgess, Jr.
Quantity | Value | Units | Method | Reference | Comment |
---|---|---|---|---|---|
ΔsubH° | 96.17 ± 0.84 | kJ/mol | V | Verevkin, Peng, et al., 1996 | ALS |
ΔsubH° | 96.2 | kJ/mol | N/A | Verevkin, Peng, et al., 1996 | DRB |

Kovats' RI, non-polar column, isothermal

Column type | Active phase | Temperature (C) | I | Reference | Comment |
---|---|---|---|---|---|
Capillary | SE-30 | 120. | 1321. | Tudor and Moldovan, 1999 | |
Capillary | SE-30 | 100. | 1322.3 | Tudor, 1997 | 40. m/0.35 mm/0.35 μm |

References

Verevkin, Peng, et al., 1996
Verevkin, S.P.; Peng, W.-H.; Beckhaus, H.D.; Ruchardt, C.,
Thermochemical study of aliphatic and phenyl-substituted germinal diacetates,
Struct. Chem., 1996, 7, 397-404. [all data]
Tudor and Moldovan, 1999
Tudor, E.; Moldovan, D.,
Temperature Dependence of the Retention Index for Perfumery Compounds on a Se-30 Glass Capillary Column. II. The Hyperbolic Equation,
J. Chromatogr., 1999, 848, 1-2, 215-227, https://doi.org/10.1016/S0021-9673(99)00412-4
. [all data]
Tudor, 1997
Tudor, E.,
Temperature dependence of the retention index for perfumery compounds on a SE-30 glass capillary column. I. Linear equations,
J. Chromatogr. A, 1997, 779, 1-2, 287-297, https://doi.org/10.1016/S0021-9673(97)00453-6
. [all data]