Benzene, 1,1'-(1-methyl-1,2-ethanediyl)bis-
- Formula: C15H16
- Molecular weight: 196.2875
- IUPAC Standard InChIKey: XLWCIHPMASUXPI-UHFFFAOYSA-N
- CAS Registry Number: 5814-85-7
- Chemical structure:
View 3d structure (requires JavaScript / HTML 5) - Other names: Bibenzyl, α-methyl-; α-Methylbibenzyl; α,β-Diphenylpropane; Propane, 1,2-diphenyl-; 1,2-Diphenylpropane; 2-Phenylpropylbenzene

Condensed phase thermochemistry data

Data compiled by: Hussein Y. Afeefy, Joel F. Liebman, and Stephen E. Stein
Quantity | Value | Units | Method | Reference | Comment |
---|---|---|---|---|---|
ΔcH°liquid | -7866. | kJ/mol | Ccb | Serijan and Wise, 1951 | Corresponding ΔfHºliquid = -320. kJ/mol (simple calculation by NIST; no Washburn corrections) |

Phase change data

Data compiled by: Thermodynamics Research Center, NIST Boulder Laboratories, Chris Muzny director
Quantity | Value | Units | Method | Reference | Comment |
---|---|---|---|---|---|
Tboil | 554. ± 3. | K | AVG | N/A | Average of 6 values; Individual data points |
Quantity | Value | Units | Method | Reference | Comment |
Tfus | 273.29 | K | N/A | Serijan and Wise, 1951, 2 | Uncertainty assigned by TRC = 0.2 K |
Tfus | 273.3 | K | N/A | Boelhouwer, Nederbragt, et al., 1950 | Uncertainty assigned by TRC = 2. K |
Tfus | 325. | K | N/A | Levene, Mikeska, et al., 1930 | Uncertainty assigned by TRC = 5. K |
Tfus | 325. | K | N/A | Von Braun and Manz, 1929 | Uncertainty assigned by TRC = 4. K |

References

Serijan and Wise, 1951
Serijan, K.T.; Wise, P.H.,
Dicyclic hydrocarbons. III. Diphenyl- and dicyclohexylalkanes through C15,
J. Am. Chem. Soc., 1951, 73, 4766-4769. [all data]
Serijan and Wise, 1951, 2
Serijan, K.T.; Wise, P.H.,
Dicylic Hydrocarbons. III. Diphenyl- and Dicyclohexylalkanes through C15,
J. Am. Chem. Soc., 1951, 73, 4766. [all data]
Boelhouwer, Nederbragt, et al., 1950
Boelhouwer, J.W.M.; Nederbragt, G.W.; Verberg, G.W.,
Viscosity data of organic liquids,
Appl. Sci. Res., Sect. A, 1950, 2, 249. [all data]
Levene, Mikeska, et al., 1930
Levene, P.A.; Mikeska, L.A.; Passoth, K.,
J. Biol. Chem., 1930, 88, 27. [all data]
Von Braun and Manz, 1929
Von Braun, J.; Manz, G.,
Justus Liebigs Ann. Chem., 1929, 468, 258. [all data]