Naphthalene, 2,6-dimethyl-
- Formula: C12H12
- Molecular weight: 156.2237
- IUPAC Standard InChIKey: YGYNBBAUIYTWBF-UHFFFAOYSA-N
- CAS Registry Number: 581-42-0
- Chemical structure:
View 3d structure (requires JavaScript / HTML 5) - Other names: 2,6-Dimethylnaphthalene

Gas phase thermochemistry data

Data compiled by: Glushko Thermocenter, Russian Academy of Sciences, Moscow
Constant pressure heat capacity of gas
Cp,gas (cal/mol*K) | Temperature (K) | Reference | Comment |
---|---|---|---|
11.9 | 50. | Thermodynamics Research Center, 1997 | p=1 bar. |
18.3 | 100. | ||
23.7 | 150. | ||
29.76 | 200. | ||
39.70 | 273.15 | ||
43.21 | 298.15 | ||
43.48 | 300. | ||
57.10 | 400. | ||
68.86 | 500. | ||
78.51 | 600. | ||
86.42 | 700. | ||
92.97 | 800. | ||
98.45 | 900. | ||
103.1 | 1000. | ||
107. | 1100. | ||
110. | 1200. | ||
113. | 1300. | ||
116. | 1400. | ||
118. | 1500. |

Condensed phase thermochemistry data

Data compiled as indicated in comments:
ALS - Hussein Y. Afeefy, Joel F. Liebman, and Stephen E. Stein
DH - Eugene S. Domalski and Elizabeth D. Hearing
Quantity | Value | Units | Method | Reference | Comment |
---|---|---|---|---|---|
ΔfH°solid | -1.37 ± 0.40 | kcal/mol | Ccb | Good, 1973 | crystal phase; ALS |
Quantity | Value | Units | Method | Reference | Comment |
ΔcH°solid | -1537.14 ± 0.38 | kcal/mol | Ccb | Good, 1973 | crystal phase; Corresponding ΔfHºsolid = -1.36 kcal/mol (simple calculation by NIST; no Washburn corrections); ALS |
Quantity | Value | Units | Method | Reference | Comment |
S°solid,1 bar | 54.460 | cal/mol*K | N/A | Finke, Messerly, et al., 1977 | DH |
Constant pressure heat capacity of solid
Cp,solid (cal/mol*K) | Temperature (K) | Reference | Comment |
---|---|---|---|
48.650 | 298.15 | Finke, Messerly, et al., 1977 | T = 10 to 440 K.; DH |
48.40 | 298.15 | Good, 1973 | DH |

Phase change data

Data compiled as indicated in comments:
BS - Robert L. Brown and Stephen E. Stein
TRC - Thermodynamics Research Center, NIST Boulder Laboratories, Chris Muzny director
AC - William E. Acree, Jr., James S. Chickos
ALS - Hussein Y. Afeefy, Joel F. Liebman, and Stephen E. Stein
DH - Eugene S. Domalski and Elizabeth D. Hearing
Quantity | Value | Units | Method | Reference | Comment |
---|---|---|---|---|---|
Tboil | 536. ± 6. | K | AVG | N/A | Average of 7 values; Individual data points |
Quantity | Value | Units | Method | Reference | Comment |
Tfus | 387.4 | K | N/A | Kotula and Rabczuk, 1985 | Uncertainty assigned by TRC = 2. K; TRC |
Tfus | 383.27 | K | N/A | Szafranski, 1984 | Uncertainty assigned by TRC = 0.1 K; TRC |
Tfus | 383.9 | K | N/A | Smith, 1980 | Uncertainty assigned by TRC = 0.2 K; TRC |
Tfus | 384.15 | K | N/A | Luther and Riechel, 1950 | Uncertainty assigned by TRC = 0.5 K; TRC |
Tfus | 336. | K | N/A | Linstead, Millidge, et al., 1937 | Uncertainty assigned by TRC = 4. K; TRC |
Quantity | Value | Units | Method | Reference | Comment |
Ttriple | 383.31 | K | N/A | Finke, Messerly, et al., 1977, 2 | Uncertainty assigned by TRC = 0.02 K; TRC |
Ttriple | 383.31 | K | N/A | Osborn and Douslin, 1975 | Uncertainty assigned by TRC = 0.03 K; TRC |
Enthalpy of vaporization
ΔvapH (kcal/mol) | Temperature (K) | Method | Reference | Comment |
---|---|---|---|---|
13.7 | 399. | A | Stephenson and Malanowski, 1987 | Based on data from 384. to 418. K. See also Osborn and Douslin, 1975, 2 and Boublik, Fried, et al., 1984.; AC |
13.7 | 383. | IP | Finke, Messerly, et al., 1977 | Based on data from 384. to 418. K.; AC |
13.5 | 400. | IP | Finke, Messerly, et al., 1977 | Based on data from 384. to 418. K.; AC |
13.3 | 420. | IP | Finke, Messerly, et al., 1977 | Based on data from 384. to 418. K.; AC |
Antoine Equation Parameters
log10(P) = A − (B / (T + C))
P = vapor pressure (atm)
T = temperature (K)
View plot Requires a JavaScript / HTML 5 canvas capable browser.
Temperature (K) | A | B | C | Reference | Comment |
---|---|---|---|---|---|
384. to 418. | 3.14260 | 1302.791 | -135.652 | Osborn and Douslin, 1975, 2 | Coefficents calculated by NIST from author's data. |
Enthalpy of sublimation
ΔsubH (kcal/mol) | Temperature (K) | Method | Reference | Comment |
---|---|---|---|---|
20.2 ± 0.45 | 366. | N/A | Finke, Messerly, et al., 1977 | Based on data from 350. to 383. K. See also Osborn and Douslin, 1975, 2 and Stephenson and Malanowski, 1987.; AC |
19.7 | 383. | B | Osborn and Douslin, 1975, 2 | AC |
20.07 ± 0.09 | 379.2 | V | Aihara, 1959 | crystal phase; ALS |
20.1 | 291. | V | Aihara, 1959, 2 | Based on data from 279. to 304. K. See also Stephenson and Malanowski, 1987.; AC |
Enthalpy of fusion
ΔfusH (kcal/mol) | Temperature (K) | Method | Reference | Comment |
---|---|---|---|---|
5.98870 | 383.32 | N/A | Finke, Messerly, et al., 1977 | DH |
6.05 | 385.2 | DSC | Cheon and Kim, 2007 | AC |
5.989 | 383.3 | N/A | Acree, 1991 | AC |
Entropy of fusion
ΔfusS (cal/mol*K) | Temperature (K) | Reference | Comment |
---|---|---|---|
15.62 | 383.32 | Finke, Messerly, et al., 1977 | DH |

Gas phase ion energetics data

Data compiled by: John E. Bartmess
Electron affinity determinations
EA (eV) | Method | Reference | Comment |
---|---|---|---|
<0.160 ± 0.074 | ECD | Wojnarovits and Foldiak, 1981 | EA is an upper limit: Chen and Wentworth, 1989. G3MP2B3 calculations indicate an EA of ca. -0.1 eV, anion unbound. |

Kovats' RI, non-polar column, isothermal

Column type | Active phase | Temperature (C) | I | Reference | Comment |
---|---|---|---|---|---|
Capillary | Squalane | 120. | 1380.4 | Gerasimenko and Nabivach, 1997 | Column length: 50. m |
Capillary | OV-1 | 150. | 1400. | Zhang, Chen, et al., 1997 | 25. m/0.2 mm/0.33 μm, N2 |
Capillary | OV-1 | 150. | 1400. | Zhang, Chen, et al., 1997 | 25. m/0.2 mm/0.33 μm, N2 |
Capillary | OV-1 | 150. | 1401. | Zhang, Chen, et al., 1997 | 25. m/0.2 mm/0.33 μm, N2 |
Capillary | OV-1 | 160. | 1408. | Zhang, Chen, et al., 1997 | 25. m/0.2 mm/0.33 μm, N2 |
Capillary | OV-101 | 145. | 1403. | Grinberg, Tokarev, et al., 1984 | He; Column length: 50. m; Column diameter: 0.25 mm |
Capillary | OV-101 | 145. | 1402. | Grinberg, Tokarev, et al., 1984 | He; Column length: 100. m; Column diameter: 0.25 mm |
Capillary | SE-30 | 130. | 1387. | Bredael, 1982 | Column length: 100. m; Column diameter: 0.5 mm |
Capillary | SE-30 | 150. | 1399. | Bredael, 1982 | Column length: 100. m; Column diameter: 0.5 mm |
Capillary | OV-101 | 140. | 1395.6 | Gerasimenko, Kirilenko, et al., 1981 | N2; Column length: 50. m; Column diameter: 0.3 mm |
Capillary | OV-101 | 160. | 1408.8 | Gerasimenko, Kirilenko, et al., 1981 | N2; Column length: 50. m; Column diameter: 0.3 mm |
Capillary | OV-1 | 130. | 1388. | Engewald, Wennrich, et al., 1979 | Column length: 50. m; Column diameter: 0.23 mm |
Capillary | Squalane | 130. | 1372. | Bogoslovsky, Anvaer, et al., 1978 | |
Packed | SE-30 | 150. | 1403. | Shlyakhov, Anvaer, et al., 1975 |

Kovats' RI, non-polar column, temperature ramp

Column type | Active phase | I | Reference | Comment |
---|---|---|---|---|
Capillary | OV-101 | 1377. | Hayes and Pitzer, 1982 | 110. m/0.25 mm/0.20 μm, He, 1. K/min; Tstart: 35. C; Tend: 200. C |

Van Den Dool and Kratz RI, non-polar column, temperature ramp

Column type | Active phase | I | Reference | Comment |
---|---|---|---|---|
Capillary | DB-5 | 1400.9 | Song, Lai, et al., 2003 | 30. m/0.25 mm/0.25 μm, He, 4. K/min; Tstart: 40. C; Tend: 310. C |
Capillary | DB-5 | 1400.0 | Song, Lai, et al., 2003 | 30. m/0.25 mm/0.25 μm, He, 40. C @ 5. min, 4. K/min; Tend: 310. C |
Capillary | DB-5 | 1390.6 | Song, Lai, et al., 2003 | 30. m/0.25 mm/0.25 μm, He, 2. K/min; Tstart: 40. C; Tend: 310. C |
Capillary | DB-5 | 1400.9 | Song, Lai, et al., 2003 | 30. m/0.25 mm/0.25 μm, He, 4. K/min; Tstart: 40. C; Tend: 310. C |
Capillary | DB-5 | 1407.3 | Song, Lai, et al., 2003 | 30. m/0.25 mm/0.25 μm, He, 6. K/min; Tstart: 40. C; Tend: 310. C |
Capillary | DB-5 | 1390.6 | Lai and Song, 1995 | 30. m/0.25 mm/0.25 μm, He, 2. K/min; Tstart: 40. C; Tend: 310. C |
Capillary | DB-5 | 1400.9 | Lai and Song, 1995 | 30. m/0.25 mm/0.25 μm, He, 4. K/min; Tstart: 40. C; Tend: 310. C |
Capillary | DB-5 | 1407.3 | Lai and Song, 1995 | 30. m/0.25 mm/0.25 μm, He, 6. K/min; Tstart: 40. C; Tend: 310. C |
Capillary | DB-5 | 1400.9 | Lai and Song, 1995 | 30. m/0.25 mm/0.25 μm, He, 4. K/min; Tstart: 40. C; Tend: 310. C |
Capillary | DB-5 | 1400.0 | Lai and Song, 1995 | 30. m/0.25 mm/0.25 μm, He, 40. C @ 5. min, 4. K/min; Tend: 310. C |
Capillary | Petrocol DH | 1381.69 | White, Douglas, et al., 1992 | 100. m/0.25 mm/0.5 μm, He, 1. K/min; Tstart: 30. C; Tend: 220. C |
Capillary | Petrocol DH | 1381.93 | White, Douglas, et al., 1992 | 100. m/0.25 mm/0.5 μm, He, 1. K/min; Tstart: 30. C; Tend: 220. C |
Capillary | Petrocol DH | 1382. | White, Hackett, et al., 1992 | 100. m/0.25 mm/0.5 μm, He, 1. K/min; Tstart: 30. C; Tend: 220. C |
Capillary | DB-5 | 1409. | Rostad and Pereira, 1986 | 30. m/0.26 mm/0.25 μm, He, 50. C @ 4. min, 6. K/min, 300. C @ 20. min |
Capillary | OV-101 | 1377. | Hayes and Pitzer, 1981 | 108. m/0.25 mm/0.2 μm, 1. K/min; Tstart: 35. C; Tend: 200. C |

Van Den Dool and Kratz RI, non-polar column, custom temperature program

Column type | Active phase | I | Reference | Comment |
---|---|---|---|---|
Capillary | DB-5MS | 1416. | Selli, Rannou, et al., 2006 | 30. m/0.32 mm/0.5 μm, He; Program: 50C => 5C/min => 200C => 8C/min => 260C(5min) |
Capillary | HP-5 | 1400.2 | Sandercock and du Pasquier, 2003 | 30. m/0.25 mm/0.25 μm, He; Program: 40C(3min) => 4C/min => 208C => 25C/min => 290C(5min) |
Capillary | 5 % Phenyl methyl siloxane | 1394. | Yasuhara, Shiraishi, et al., 1997 | 25. m/0.31 mm/0.52 μm, He; Program: 50C(2min) => (20C/min) => 120C => (7C/min) => 310C(10min) |

Van Den Dool and Kratz RI, polar column, temperature ramp

Column type | Active phase | I | Reference | Comment |
---|---|---|---|---|
Capillary | DB-Wax | 2012. | Selli, Rannou, et al., 2006 | 30. m/0.25 mm/0.5 μm, He, 4. K/min, 260. C @ 5. min; Tstart: 50. C |
Capillary | EC-WAX | 2038. | le Guen, Prost, et al., 2001 | 30. m/0.32 mm/0.5 μm, He, 40. C @ 2. min, 5. K/min, 250. C @ 10. min |
Capillary | DB-Wax | 2038. | le Guen, Prost, et al., 2000 | 60. m/0.32 mm/0.5 μm, He, 40. C @ 5. min, 3. K/min, 250. C @ 10. min |
Capillary | DB-Wax | 2031. | Le Guen, Prost, et al., 2000 | 60. m/0.32 mm/0.5 μm, He, 40. C @ 2. min, 4. K/min, 250. C @ 10. min |
Capillary | DB-Wax | 2038. | Le Guen, Prost, et al., 2000 | 60. m/0.32 mm/0.5 μm, He, 40. C @ 2. min, 4. K/min, 250. C @ 10. min |

Normal alkane RI, non-polar column, isothermal

Column type | Active phase | Temperature (C) | I | Reference | Comment |
---|---|---|---|---|---|
Capillary | OV-101 | 120. | 1396. | Nabivach and Gerasimenko, 1996 | |
Capillary | Polidimethyl siloxane | 130. | 1388. | Nabivach and Gerasimenko, 1996 | |
Capillary | Polidimethyl siloxane | 130. | 1388. | Nabivach and Gerasimenko, 1996 | |
Capillary | Polidimethyl siloxane | 130. | 1389. | Nabivach and Gerasimenko, 1996 | |
Capillary | Squalane | 120. | 1372. | Nabivach and Gerasimenko, 1996 | |
Capillary | Squalane | 120. | 1380. | Nabivach and Gerasimenko, 1996 | |
Capillary | Squalane | 130. | 1372. | Papazova and Pankova, 1975 | N2; Column length: 100. m; Column diameter: 0.25 mm |
Packed | Polydimethyl siloxane | 147. | 1400. | Ferrand, 1962 |

Normal alkane RI, non-polar column, temperature ramp

Column type | Active phase | I | Reference | Comment |
---|---|---|---|---|
Capillary | Petrocol DH | 1382. | Supelco, 2012 | 100. m/0.25 mm/0.50 μm, Helium, 20. C @ 15. min, 15. K/min, 220. C @ 30. min |
Capillary | HP-5 MS | 1409. | Radulovic, Blagojevic, et al., 2010 | 30. m/0.25 mm/0.25 μm, Helium, 5. K/min, 290. C @ 10. min; Tstart: 70. C |
Capillary | HP-5 MS | 1408. | Radulovic, Dordevic, et al., 2010 | 30. m/0.25 mm/0.25 μm, Helium, 5. K/min, 290. C @ 10. min; Tstart: 70. C |
Capillary | SPB-5 | 1416. | Pino, Marquez, et al., 2006 | 30. m/0.25 mm/0.25 μm, Helium, 60. C @ 2. min, 4. K/min, 250. C @ 20. min |
Capillary | Ultra-1 | 1384. | Elizalde-González, Hutfliess, et al., 1996 | 50. m/0.2 mm/0.33 μm, H2, 3. K/min, 300. C @ 35. min; Tstart: 60. C |

Normal alkane RI, non-polar column, custom temperature program

Column type | Active phase | I | Reference | Comment |
---|---|---|---|---|
Capillary | OV-1 | 1388.3 | Dimov, Osman, et al., 1994 | Program: not specified |
Capillary | Polydimethyl siloxane, unknown content of Ph-groups | 1410. | Geldon, 1989 | Program: not specified |
Capillary | Polydimethyl siloxane, unknown content of Ph-groups | 1411. | Geldon, 1989 | Program: not specified |
Capillary | OV-1, SE-30, Methyl silicone, SP-2100, OV-101, DB-1, etc. | 1388. | Waggott and Davies, 1984 | Hydrogen; Column length: 50. m; Column diameter: 0.32 mm; Program: not specified |

Lee's RI, non-polar column, temperature ramp

Column type | Active phase | I | Reference | Comment |
---|---|---|---|---|
Capillary | DB-5MS | 240.68 | Sun, Zhou, et al., 2008 | 30. m/0.25 mm/0.25 μm, 50. C @ 2. min, 6. K/min, 300. C @ 16. min |
Capillary | 5 % Phenyl methyl siloxane | 237.58 | Skrbic and Onjia, 2006 | 2. K/min; Tstart: 50. C; Tend: 250. C |
Capillary | 5 % Phenyl methyl siloxane | 239.70 | Skrbic and Onjia, 2006 | 80. C @ 2. min, 8. K/min, 300. C @ 10. min |
Capillary | DB-5MS | 240.42 | Chen, Keeran, et al., 2002 | 30. m/0.25 mm/0.5 μm, 40. C @ 1. min, 10. K/min; Tend: 310. C |
Capillary | PTE-5 | 240.56 | Wang, Jia, et al., 2000 | 30. m/0.25 mm/0.25 μm, 60. C @ 1.5 min, 8. K/min, 300. C @ 12.5 min |
Capillary | SE-52 | 239.97 | Wang, Peng, et al., 1997 | 4. K/min; Column length: 30. m; Column diameter: 0.30 mm; Tstart: 40. C; Tend: 250. C |
Capillary | DB-5 | 240.04 | Williams and Horne, 1995 | He, 60. C @ 2. min, 5. K/min; Column length: 25. m; Column diameter: 0.3 mm; Tend: 270. C |
Capillary | DB-5 | 241.00 | Wang, Fingas, et al., 1994 | 30. m/0.32 mm/0.25 μm, He, 50. C @ 2. min, 6. K/min; Tend: 300. C |
Capillary | CP Sil 8 CB | 240.5 | Bundt, Herbel, et al., 1991 | 50. m/0.25 mm/0.25 μm, He, 4. K/min; Tstart: 80. C; Tend: 300. C |
Capillary | SE-54 | 237.23 | Guillén, Blanco, et al., 1989 | 20. m/0.22 mm/0.20 μm, He, 4. K/min; Tstart: 50. C; Tend: 300. C |
Capillary | DB-5 | 240.89 | Rostad and Pereira, 1986 | 30. m/0.26 mm/0.25 μm, He, 50. C @ 4. min, 6. K/min, 300. C @ 20. min |
Capillary | DB-5 | 233.9 | Viau, Studak, et al., 1984 | Helium, 4. K/min; Column length: 30. m; Column diameter: 0.32 mm; Tstart: 90. C; Tend: 250. C |
Capillary | SE-52 | 240.28 | Vassilaros, Kong, et al., 1982 | 20. m/0.30 mm/0.25 μm, H2, 40. C @ 2. min, 4. K/min; Tend: 265. C |
Capillary | SE-52 | 237.58 | Lee, Vassilaros, et al., 1979 | 12. m/0.3 mm/0.34 μm, He, 2. K/min; Tstart: 50. C; Tend: 250. C |

Lee's RI, non-polar column, custom temperature program

Column type | Active phase | I | Reference | Comment |
---|---|---|---|---|
Capillary | DB-5 | 241.2 | Fuentes, Font, et al., 2007 | Column length: 60. m; Program: not specified |
Capillary | DB-5MS | 240.3 | Aracil, Font, et al., 2005 | Column length: 60. m; Column diameter: 0.25 mm; Program: not specified |
Capillary | HP-5MS | 239.11 | Cheng, Liu, et al., 2005 | 30. m/0.30 mm/0.25 μm, He; Program: 50 0C (2 min) 8 0C/min -> 120 0C (3 min) 10 0C/min -> 230 0C |
Capillary | Ultra-1 | 237.6 | Sremac, Skrbic, et al., 2005 | 50. m/0.32 mm/0.50 μm, Nitrogen; Program: 40-100 0C 3-15 0C/min -> 290 0C |
Capillary | Ultra-1 | 239.7 | Sremac, Skrbic, et al., 2005 | 50. m/0.32 mm/0.50 μm, Nitrogen; Program: 40-100 0C 3-15 0C/min -> 290 0C |
Capillary | DB-5 | 239.7 | Lundstedt, Haglund, et al., 2003 | 30. m/0.25 mm/0.25 μm; Program: not specified |
Capillary | HP-5 | 241.13 | Sandercock and du Pasquier, 2003 | 30. m/0.25 mm/0.25 μm, He; Program: 40C(3min) => 4C/min => 208C => 25C/min => 290C(5min) |
Capillary | SE-52 | 237.58 | Wang, Peng, et al., 1997 | Column length: 30. m; Column diameter: 0.30 mm; Program: not specified |
Capillary | CP Sil 8 CB | 240.3 | Bundt, Herbel, et al., 1991 | 50. m/0.25 mm/0.25 μm, He; Program: not specified |
Capillary | CP Sil 8 CB | 240.5 | Bundt, Herbel, et al., 1991 | 50. m/0.25 mm/0.25 μm, He; Program: not specified |
Capillary | DB-5 | 236.80 | Naikwadi, Charbonneau, et al., 1987 | Column length: 30. m; Column diameter: 0.32 mm; Program: not specified |
Capillary | DB-5 | 237.58 | Naikwadi, Charbonneau, et al., 1987 | Column length: 30. m; Column diameter: 0.32 mm; Program: not specified |

Henry's Law data

Data compiled by: Rolf Sander
Henry's Law constant (water solution)
kH(T) = k°H exp(d(ln(kH))/d(1/T) ((1/T) - 1/(298.15 K)))
k°H = Henry's law constant for solubility in water at 298.15 K (mol/(kg*bar))
d(ln(kH))/d(1/T) = Temperature dependence constant (K)
k°H (mol/(kg*bar)) | d(ln(kH))/d(1/T) (K) | Method | Reference | Comment |
---|---|---|---|---|
0.82 | Q | N/A | missing citation give several references for the Henry's law constants but don't assign them to specific species. |

References

Thermodynamics Research Center, 1997
Thermodynamics Research Center,
Selected Values of Properties of Chemical Compounds., Thermodynamics Research Center, Texas A&M University, College Station, Texas, 1997. [all data]
Good, 1973
Good, W.D.,
The enthalpies of combustion and formation of 1,8-dimethylnaphthalene, 2,3-dimethylnaphthalene, 2,6-dimethylnaphthalene, and 2,7-dimethylnaphthalene,
J. Chem. Thermodyn., 1973, 5, 715-720. [all data]
Finke, Messerly, et al., 1977
Finke, H.L.; Messerly, J.F.; Lee, S.H.; Osborn, A.G.; Douslin, D.R.,
Comprehensive thermodynamic studies of seven aromatic hydrocarbons,
J. Chem. Thermodyn., 1977, 9, 937-956. [all data]
Kotula and Rabczuk, 1985
Kotula, I.; Rabczuk, A.,
DTA Investigation of the Solid-Liquid Equilibrium for Mehtyl Derivatives of Naphthalene with Some Nitroaromatics,
J. Therm. Anal., 1985, 30, 195. [all data]
Szafranski, 1984
Szafranski, A.M.,
Solid-Liquid Equilibrium,
Int. DATA Ser., Sel. Data Mixtures, Ser. A, 1984, No. 1, 40-50. [all data]
Smith, 1980
Smith, G.W.,
Phase behavior of some condensed polycyclic aromatics,
Mol. Cryst. Liq. Cryst., 1980, 64, 15. [all data]
Luther and Riechel, 1950
Luther, H.; Riechel, C.,
The Raman Spectra of Polymethylnphthalenes,
Z. Phys. Chem. (Leipzig), 1950, 195, 103. [all data]
Linstead, Millidge, et al., 1937
Linstead; Millidge; Walpole,
J. Chem. Soc., 1937, 1937, 1140. [all data]
Finke, Messerly, et al., 1977, 2
Finke, H.L.; Messerly, J.F.; Lee, S.H.; Osborn, A.G.; Douslin, D.R.,
Comprehensive thermodynamic studies of seven aromatic hydrocarbons,
J. Chem. Thermodyn., 1977, 9, 937. [all data]
Osborn and Douslin, 1975
Osborn, A.G.; Douslin, D.R.,
Vapor Pressure and Derived Enthalpies of Vaporization for Some Condensed Ring Hydrocarbons,
J. Chem. Eng. Data, 1975, 20, 229-31. [all data]
Stephenson and Malanowski, 1987
Stephenson, Richard M.; Malanowski, Stanislaw,
Handbook of the Thermodynamics of Organic Compounds, 1987, https://doi.org/10.1007/978-94-009-3173-2
. [all data]
Osborn and Douslin, 1975, 2
Osborn, Ann G.; Douslin, Donald R.,
Vapor pressures and derived enthalpies of vaporization for some condensed-ring hydrocarbons,
J. Chem. Eng. Data, 1975, 20, 3, 229-231, https://doi.org/10.1021/je60066a022
. [all data]
Boublik, Fried, et al., 1984
Boublik, T.; Fried, V.; Hala, E.,
The Vapour Pressures of Pure Substances: Selected Values of the Temperature Dependence of the Vapour Pressures of Some Pure Substances in the Normal and Low Pressure Region, 2nd ed., Elsevier, New York, 1984, 972. [all data]
Aihara, 1959
Aihara, A.,
Estimation of the energy of hydrogen bonds formed in crystals. I. Sublimation pressures of some organic molecular crystals and the additivity of lattice energy,
Bull. Chem. Soc. Jpn., 1959, 32, 1242. [all data]
Aihara, 1959, 2
Aihara, Ariyuki,
Estimation of the Energy of Hydrogen Bonds Formed in Crystals. I. Sublimation Pressures of Some Organic Molecular Crystals and the Additivity of Lattice Energy,
Bull. Chem. Soc. Jpn., 1959, 32, 11, 1242-1248, https://doi.org/10.1246/bcsj.32.1242
. [all data]
Cheon and Kim, 2007
Cheon, Yang-Ho; Kim, Kwang-Joo,
Solid-Liquid Equilibria of Binary Mixtures of Dimethylnaphthalene Isomers,
J. Chem. Eng. Data, 2007, 52, 4, 1390-1393, https://doi.org/10.1021/je700088n
. [all data]
Acree, 1991
Acree, William E.,
Thermodynamic properties of organic compounds: enthalpy of fusion and melting point temperature compilation,
Thermochimica Acta, 1991, 189, 1, 37-56, https://doi.org/10.1016/0040-6031(91)87098-H
. [all data]
Wojnarovits and Foldiak, 1981
Wojnarovits, L.; Foldiak, G.,
Electron capture detection of aromatic hydrocarbons,
J. Chromatogr. Sci., 1981, 206, 511. [all data]
Chen and Wentworth, 1989
Chen, E.C.M.; Wentworth, W.E.,
Experimental Determination of Electron Affinities of Organic Molecules,
Mol. Cryst. Liq. Cryst., 1989, 171, 271. [all data]
Gerasimenko and Nabivach, 1997
Gerasimenko, V.A.; Nabivach, V.M.,
Sorption-structure correlations in the series of alkyl derivatives of naphthalene,
J. Anal. Chem. USSR (Engl. Transl.), 1997, 52, 1, 21-27. [all data]
Zhang, Chen, et al., 1997
Zhang, M.; Chen, B.; Shen, S.; Chen, S.,
Compositional studies of high-temperature coal tar by g.c.-FT-i.r. analysis of middle oil fractions,
Fuel, 1997, 76, 5, 415-423, https://doi.org/10.1016/S0016-2361(97)85518-4
. [all data]
Grinberg, Tokarev, et al., 1984
Grinberg, A.A.; Tokarev, M.I.; Bigdash, T.V.; Kogan, L.O.; Leont'eva, S.A.,
Special features of using Kovats retention indices in chromatomass spectrometric analysis,
Zh. Anal. Khim., 1984, 39, 6, 909-911. [all data]
Bredael, 1982
Bredael, P.,
Retention indices of hydrocarbons on SE-30,
J. Hi. Res. Chromatogr. Chromatogr. Comm., 1982, 5, 6, 325-328, https://doi.org/10.1002/jhrc.1240050610
. [all data]
Gerasimenko, Kirilenko, et al., 1981
Gerasimenko, V.A.; Kirilenko, A.V.; Nabivach, V.M.,
Capillary gas chromatography of aromatic compounds found in coal tar fractions,
J. Chromatogr., 1981, 208, 1, 9-16, https://doi.org/10.1016/S0021-9673(00)87953-4
. [all data]
Engewald, Wennrich, et al., 1979
Engewald, W.; Wennrich, L.; Ritter, E.,
Molekülstruktur und Retentionsverhalten. XII. Zur Retention von Alkylnaphthalinen Bei der Gasverteilungs- und Gas-Adsorptions-Chromatographie,
J. Chromatogr., 1979, 174, 2, 315-323, https://doi.org/10.1016/S0021-9673(00)86005-7
. [all data]
Bogoslovsky, Anvaer, et al., 1978
Bogoslovsky, Yu.N.; Anvaer, B.I.; Vigdergauz, M.S.,
Chromatographic constants in gas chromatography (in Russian), Standards Publ. House, Moscow, 1978, 192. [all data]
Shlyakhov, Anvaer, et al., 1975
Shlyakhov, A.F.; Anvaer, B.I.; Zolotareva, O.V.; Romina, N.N.; Novikova, N.V.; Koreshkova, R.I.,
On the possibility of group indentification of hydrocarbons by gas chromatography from temperature coefficients of retention indices,
Zh. Anal. Khim., 1975, 30, 788-792. [all data]
Hayes and Pitzer, 1982
Hayes, P.C., Jr.; Pitzer, E.W.,
Characterizing petroleum- and shale-derived jet fuel distillates via temperature-programmed Kováts indices,
J. Chromatogr., 1982, 253, 179-198, https://doi.org/10.1016/S0021-9673(01)88376-X
. [all data]
Song, Lai, et al., 2003
Song, C.; Lai, W.-C.; Madhusudan Reddy, K.; Wei, B.,
Chapter 7. Temperature-programmed retention indices for GC and GC-MS of hydrocarbon fuels and simulated distillation GC of heavy oils
in Analytical advances for hydrocarbon research, Hsu,C.S., ed(s)., Kluwer Academic/Plenum Publishers, New York, 2003, 147-193. [all data]
Lai and Song, 1995
Lai, W.-C.; Song, C.,
Temperature-programmed retention indices for g.c. and g.c.-m.s. analysis of coal- and petroleum-derived liquid fuels,
Fuel, 1995, 74, 10, 1436-1451, https://doi.org/10.1016/0016-2361(95)00108-H
. [all data]
White, Douglas, et al., 1992
White, C.M.; Douglas, L.J.; Hackett, J.P.; Anderson, R.R.,
Characterization of synthetic gasoline from the chloromethane-zeolite reaction,
Energy Fuels, 1992, 6, 1, 76-82, https://doi.org/10.1021/ef00031a012
. [all data]
White, Hackett, et al., 1992
White, C.M.; Hackett, J.; Anderson, R.R.; Kail, S.; Spock, P.S.,
Linear temperature programmed retention indices of gasoline range hydrocarbons and chlorinated hydrocarbons on cross-linked polydimethylsiloxane,
J. Hi. Res. Chromatogr., 1992, 15, 2, 105-120, https://doi.org/10.1002/jhrc.1240150211
. [all data]
Rostad and Pereira, 1986
Rostad, C.E.; Pereira, W.E.,
Kovats and Lee retention indices determined by gas chromatography/mass spectrometry for organic compounds of environmental interest,
J. Hi. Res. Chromatogr. Chromatogr. Comm., 1986, 9, 6, 328-334, https://doi.org/10.1002/jhrc.1240090603
. [all data]
Hayes and Pitzer, 1981
Hayes, P.C., Jr.; Pitzer, E.W.,
Kovats indices as a tool in characterizing hydrocarbon fuels in temperature programmed glass capillary gas chromatography. Part 1. Qualitative identification, Inhouse rpt. for Air Force Wright Aeronautical Labs., Air Force Wright Aeronautical Labs., Wright-Patterson AFB, Ohio, 1981, 75. [all data]
Selli, Rannou, et al., 2006
Selli, S.; Rannou, C.; Prost, C.; Robin, J.; Serot, T.,
Characterization of Aroma-Active Compounds in Rainbow Trout (Oncorhynchus mykiss) Eliciting an Off-Odor,
J. Agric. Food Chem., 2006, 54, 25, 9496-9502, https://doi.org/10.1021/jf0619582
. [all data]
Sandercock and du Pasquier, 2003
Sandercock, P.M.L.; du Pasquier, E.,
Chemical fingerprinting of unevaporated automotive gasoline samples,
Forensic Sci. Int., 2003, 134, 1, 1-10, https://doi.org/10.1016/S0379-0738(03)00081-1
. [all data]
Yasuhara, Shiraishi, et al., 1997
Yasuhara, A.; Shiraishi, H.; Nishikawa, M.; Yamamoto, T.; Uehiro, T.; Nakasugi, O.; Okumura, T.; Kenmotsu, K.; Fukui, H.; Nagase, M.; Ono, Y.; Kawagoshi, Y.; Baba, K.; Noma, Y.,
Determination of organic components in leachates from hazardous waste disposal sites in Japan by gas chromatography-mass spectrometry,
J. Chromatogr. A, 1997, 774, 1-2, 321-332, https://doi.org/10.1016/S0021-9673(97)00078-2
. [all data]
le Guen, Prost, et al., 2001
le Guen, S.; Prost, C.; Demaimay, M.,
Evaluation of the representativeness of the odor of cooked mussel extracts and the relationship between sensory descriptors and potent odorants,
J. Agric. Food Chem., 2001, 49, 3, 1321-1327, https://doi.org/10.1021/jf000781n
. [all data]
le Guen, Prost, et al., 2000
le Guen, S.; Prost, C.; Demaimay, M.,
Critical comparison of three olfactometric methods for the identification of the most potent odorants in cooked mussels (Mytilus edulis),
J. Agric. Food Chem., 2000, 48, 4, 1307-1314, https://doi.org/10.1021/jf990745s
. [all data]
Le Guen, Prost, et al., 2000
Le Guen, S.; Prost, C.; Demaimay, M.,
Characterization of odorant compounds of mussels (Mytilus edulis) according to their origin using gas chromatography-olfactometry and gas chromatography-mass spectrometry,
J. Chromatogr. A, 2000, 896, 1-2, 361-371, https://doi.org/10.1016/S0021-9673(00)00729-9
. [all data]
Nabivach and Gerasimenko, 1996
Nabivach, V.M.; Gerasimenko, V.A.,
Gas chromatographic retention characteristics of bicyclic aromatic hydrocarbons,
Coke and Chemistry (Rus), 1996, 6, 27-31. [all data]
Papazova and Pankova, 1975
Papazova, D.I.; Pankova, M.C.,
Identification of individual aromatic hydrocarbons in kerosene fraction (b.p. 150-250 °),
J. Chromatogr., 1975, 105, 2, 411-414, https://doi.org/10.1016/S0021-9673(01)82276-7
. [all data]
Ferrand, 1962
Ferrand, R.,
Gas phase chromatography using retention indices for the analysis of tars and their hydrogenation products,
Journees internationales d'etude des methodes de separation immediate at de chromatographie; Org. sur l'initiative du IX., 1962, 132-140. [all data]
Supelco, 2012
Supelco, CatalogNo. 24160-U,
Petrocol DH Columns. Catalog No. 24160-U, 2012, retrieved from http://www.sigmaaldrich.com/etc/medialib/docs/Supelco/Datasheet/1/w97949.Par.0001.File.tmp/w97949.pdf. [all data]
Radulovic, Blagojevic, et al., 2010
Radulovic, N.; Blagojevic, P.; Palic, R.,
Comparative study of the leaf volatiles of Arctostaphylos uva-ursi (L.) Spreng. and Vaccinium vitis-idaea L. (Ericaceae),
Molecules, 2010, 15, 9, 6168-6185, https://doi.org/10.3390/molecules15096168
. [all data]
Radulovic, Dordevic, et al., 2010
Radulovic, N.; Dordevic, N.; Markovic, M.; Palic, R.,
Volatile constituents of Glechoma Hirsuta Waldst. Kit. and G. Hederacea L. (Lamiaceae),
Bull. Chem. Soc. Ethiop., 2010, 24, 1, 67-76, https://doi.org/10.4314/bcse.v24i1.52962
. [all data]
Pino, Marquez, et al., 2006
Pino, J.A.; Marquez, E.; Marbot, R.,
Volatile constituents from tea of roselle (Hibiscus sabdariffa L.),
Rev. CENIC Ciencias Quimicas, 2006, 37, 3, 127-129. [all data]
Elizalde-González, Hutfliess, et al., 1996
Elizalde-González, M.P.; Hutfliess, M.; Hedden, K.,
Retention index system, adsorption characteristics, and sructure correlations of polycyclic aromatic hydrocarbons in fuels,
J. Hi. Res. Chromatogr., 1996, 19, 6, 345-352, https://doi.org/10.1002/jhrc.1240190608
. [all data]
Dimov, Osman, et al., 1994
Dimov, N.; Osman, A.; Mekenyan, Ov.; Papazova, D.,
Selection of moelcular descriptors used in quantitative structure-gas chromatographic retention relationships. I. Application to alkylbenzenes and naphthalenes,
Anal. Chim. Acta., 1994, 298, 3, 303-317, https://doi.org/10.1016/0003-2670(94)00280-0
. [all data]
Geldon, 1989
Geldon, A.L.,
Ground Water Hydrology of the Central Raton Basin, Colorado and New Mexico, US Geological Survey, US Government Printing Office, 1989, 104. [all data]
Waggott and Davies, 1984
Waggott, A.; Davies, I.W.,
Identification of organic pollutants using linear temperature programmed retention indices (LTPRIs) - Part II, 1984, retrieved from http://dwi.defra.gov.uk/research/completed-research/reports/dwi0383.pdf. [all data]
Sun, Zhou, et al., 2008
Sun, P.; Zhou, Q.; Li, G.; Wang, X.; Zhao, Y.; Cao, L.,
fingerprint analysis of polycyclic aromatic hydrocarbons in crude oil by internal standard method,
J. Instrumental Anal., 2008, 27, 4, 344-348. [all data]
Skrbic and Onjia, 2006
Skrbic, B.; Onjia, A.,
Prediction of Lee Retention Indices of Polycyclic Aromatic Hydrocarbons by Artificial Neural Networks,
J. Chromatorg. A, 2006, 1108, 2, 279-284, https://doi.org/10.1016/j.chroma.2006.01.080
. [all data]
Chen, Keeran, et al., 2002
Chen, P.H.; Keeran, W.S.; Van Ausdale, W.A.; Schindler, D.R.; Roberts, D.W.,
Application of Lee retention indices to the confirmation of tentatively identified compounds from GC/MS analysis of environmental samples, Technical paper, Analytical Services Division, Environmental ScienceEngineering, Inc, PO Box 1703, Gainesville, FL 32602, 2002, 11. [all data]
Wang, Jia, et al., 2000
Wang, J.; Jia, C.R.; Wong, C.K.; Wong, P.K.,
Characterization of polycyclic aromatic hydrocarbons created in lubricating oils,
Water Air Soil Poll., 2000, 120, 3/4, 381-396, https://doi.org/10.1023/A:1005251618062
. [all data]
Wang, Peng, et al., 1997
Wang, Y.; Peng, P.; Cui, S.; Zhang, Y.,
Identification of PAH in the Suzhou River bed sediments by GC/MS and PAH retention index system,
J. Nanjing Norm. Univ. (Nat. Sci.), 1997, 20, 2, 47-68. [all data]
Williams and Horne, 1995
Williams, P.T.; Horne, P.A.,
Analysis of aromatic hydrocarbons in pyrolytic oil derived from biomass,
J. Anal. Appl. Pyrolysis, 1995, 31, 15-37, https://doi.org/10.1016/0165-2370(94)00814-H
. [all data]
Wang, Fingas, et al., 1994
Wang, Z.; Fingas, M.; Li, K.,
Fractionation of a light crude oil and identification and quantitation of aliphatic, aromatic, and biomarker comopunds by GC-FID and GC-MS, Part II,
J. Chromatogr. Sci., 1994, 32, 9, 367-382, https://doi.org/10.1093/chromsci/32.9.367
. [all data]
Bundt, Herbel, et al., 1991
Bundt, J.; Herbel, W.; Steinhart, H.; Franke, S.; Francke, W.,
Structure-type separation of diesel fuels by solid phase extraction and identification of the two- and three-ring aromatics by capillary GC-mass spectrometry,
J. Hi. Res. Chromatogr., 1991, 14, 2, 91-98, https://doi.org/10.1002/jhrc.1240140205
. [all data]
Guillén, Blanco, et al., 1989
Guillén, M.D.; Blanco, J.; Bermejo, J.; Blanco, C.G.,
Temperature programmed retention indices of some PAHs on Capillary columns coated with OV-1701 and SE-54,
J. Hi. Res. Chromatogr., 1989, 12, 8, 552-554, https://doi.org/10.1002/jhrc.1240120816
. [all data]
Viau, Studak, et al., 1984
Viau, A.C.; Studak, S.M.; Karasek, F.W.,
Comparative analysis of hazardous compounds on flu-ash from municipal waste incineration by gas chromatography / mass spectrometry,
Can. J. Chem., 1984, 62, 11, 2140-2145, https://doi.org/10.1139/v84-366
. [all data]
Vassilaros, Kong, et al., 1982
Vassilaros, D.L.; Kong, R.C.; Later, D.W.; Lee, M.L.,
Linear retention index system for polycyclic aromatic compounds. Critical evaluation and additional indices,
J. Chromatogr., 1982, 252, 1-20, https://doi.org/10.1016/S0021-9673(01)88394-1
. [all data]
Lee, Vassilaros, et al., 1979
Lee, M.L.; Vassilaros, D.L.; White, C.M.; Novotny, M.,
Retention Indices for Programmed-Temperature Capillary-Column Gas Chromatography of Polycyclic Aromatic Hydrocarbons,
Anal. Chem., 1979, 51, 6, 768-773, https://doi.org/10.1021/ac50042a043
. [all data]
Fuentes, Font, et al., 2007
Fuentes, M.J.; Font, R.; Gomez-Rico, M.F.; Martin-Gullon, I.,
Pyrolysis and combustion of waste lubricant oil from diesel cars: Decomposition and pollutants,
J. Anal. Appl. Pyrolysis, 2007, 79, 1-2, 215-226, https://doi.org/10.1016/j.jaap.2006.12.004
. [all data]
Aracil, Font, et al., 2005
Aracil, I.; Font, R.; Conesa, J.A.,
Semivolatile and volatile compounds from the pyrolysis and combustion of polyvinyl chloride,
J. Anal. Appl. Pyrolysis, 2005, 74, 1-2, 465-478, https://doi.org/10.1016/j.jaap.2004.09.008
. [all data]
Cheng, Liu, et al., 2005
Cheng, D.-X.; Liu, B.-X.; Sun, Y.-A.; Xie, B.; Zhang, H.-L.,
rapid analysis of pyrolysis products of cholesterol by GC-MS assited with boiling point - Lee retention index,
journal of Instrumental Analysis - Fenxi ceshi xuebao, 2005, 24, 6, 85-88. [all data]
Sremac, Skrbic, et al., 2005
Sremac, S.; Skrbic, B.; Onjia, A.,
Artificial neural network prediction of quantitative structure-retention relationships of polycyclic aromatic hydrocarbons in gas chromatography,
J. Serb. Chem. Soc., 2005, 70, 11, 1291-1300, https://doi.org/10.2298/JSC0511291S
. [all data]
Lundstedt, Haglund, et al., 2003
Lundstedt, S.; Haglund, P.; Öberg, L.,
Degradation and formation of polycyclic aromatic compounds during bioslurry treatment of an aged gasworks soil,
Environ. Toxicol. Chem., 2003, 22, 7, 1413-1420, https://doi.org/10.1002/etc.5620220701
. [all data]
Naikwadi, Charbonneau, et al., 1987
Naikwadi, K.P.; Charbonneau, G.M.; Karasek, F.W.; Clement, R.E.,
Separation and Identification of Organic Compounds in Air Particulate Extracts by High-Performance Liquid Chromatography and Gas Chromatography-Mass Spectrometry,
J. Chromatogr., 1987, 398, 227-237, https://doi.org/10.1016/S0021-9673(01)96508-2
. [all data]