2-Chlorobenzoic acid hydrazide
- Formula: C7H7ClN2O
- Molecular weight: 170.596
- IUPAC Standard InChIKey: KPPNLSKVTKSSTG-UHFFFAOYSA-N
- CAS Registry Number: 5814-05-1
- Chemical structure:
View 3d structure (requires JavaScript / HTML 5) - Other names: 2-Chlorobenzhydrazide; o-Chlorobenzhydrazide; Benzoic acid, 2-chloro-, hydrazide; 2-chlorobenzohydrazide

Phase change data

Data compiled by: William E. Acree, Jr., James S. Chickos
Enthalpy of fusion
ΔfusH (kJ/mol) | Temperature (K) | Method | Reference |
---|---|---|---|
25.6 | 392.2 | DSC | Chickos and Acree, 2002 |

References

Chickos and Acree, 2002
Chickos, James S.; Acree, William E.,
Total phase change entropies and enthalpies,
Thermochimica Acta, 2002, 395, 1-2, 59-113, https://doi.org/10.1016/S0040-6031(02)00213-7
. [all data]