Acridine, 2-amino-
- Formula: C13H10N2
- Molecular weight: 194.2319
- IUPAC Standard InChIKey: UTXPWBKKZFLMPZ-UHFFFAOYSA-N
- CAS Registry Number: 581-28-2
- Chemical structure:
View 3d structure (requires JavaScript / HTML 5) - Permanent link for this species. Use this link for bookmarking this species for future reference.

Condensed phase thermochemistry data

Data compiled by: Hussein Y. Afeefy, Joel F. Liebman, and Stephen E. Stein
Quantity | Value | Units | Method | Reference | Comment |
---|---|---|---|---|---|
ΔcH°solid | -6711. ± 13. | kJ/mol | Ccb | Willis, 1947 | Reanalyzed by Cox and Pilcher, 1970, Original value = -6709.9 ± 9.2 kJ/mol |

References

Willis, 1947
Willis, J.B.,
The heats of combustion of some organic bases and their salts. The resonance energies of acridine and phenazine,
Trans. Faraday Soc., 1947, 43, 97-102. [all data]
Cox and Pilcher, 1970
Cox, J.D.; Pilcher, G.,
Thermochemistry of Organic and Organometallic Compounds, Academic Press, New York, 1970, 1-636. [all data]