1,4-Diphenylbutadiene-cis,cis
- Formula: C16H14
- Molecular weight: 206.2824
- IUPAC Standard InChIKey: JFLKFZNIIQFQBS-PVRNWPCDSA-N
- CAS Registry Number: 5807-76-1
- Chemical structure:
View 3d structure (requires JavaScript / HTML 5) - Stereoisomers:

Condensed phase thermochemistry data

Data compiled by: Hussein Y. Afeefy, Joel F. Liebman, and Stephen E. Stein
Quantity | Value | Units | Method | Reference | Comment |
---|---|---|---|---|---|
ΔcH°solid | -8495.7 ± 2.0 | kJ/mol | Ccb | Coops, Hoijtink, et al., 1953 | Reanalyzed by Cox and Pilcher, 1970, Original value = -8495. ± 2. kJ/mol; Corresponding ΔfHºsolid = 198.73 kJ/mol (simple calculation by NIST; no Washburn corrections) |
ΔcH°solid | -8513.0 ± 1.7 | kJ/mol | Ccb | Ott, 1928 | Corresponding ΔfHºsolid = 216.0 kJ/mol (simple calculation by NIST; no Washburn corrections) |

References

Coops, Hoijtink, et al., 1953
Coops, J.; Hoijtink, G.J.; Kramer, Th.J.E.; Faber, A.C.,
Thermochemical investigations on arylethenes. II. Heats of combustion of some para and orthotolylethenes and phenylbutadienes,
Rec. Trav. Chim. Pays/Bas, 1953, 72, 765. [all data]
Cox and Pilcher, 1970
Cox, J.D.; Pilcher, G.,
Thermochemistry of Organic and Organometallic Compounds, Academic Press, New York, 1970, 1-636. [all data]
Ott, 1928
Ott, E.,
Nachtrage zu der Untersuchung uber die Habhydrierung der Acetylen-Binding und die Abhangigkeit der Konfiguration der entstehenden Athylen-Verbin-dungen von der Reaktionsgeschwindigkeit,
Ber., 1928, 61, 2119-2123. [all data]