3-Hydroxybiphenyl
- Formula: C12H10O
- Molecular weight: 170.2072
- IUPAC Standard InChIKey: UBXYXCRCOKCZIT-UHFFFAOYSA-N
- CAS Registry Number: 580-51-8
- Chemical structure:
View 3d structure (requires JavaScript / HTML 5) - Other names: [1,1'-Biphenyl]-3-ol; 3-Biphenylol; m-Hydroxybiphenyl; m-Hydroxydiphenyl; m-Phenylphenol; Biphenyl-3-ol; 3-Phenylphenol; 3-Hydroxydiphenyl; NSC 17588; Phenol, m-phenyl-

Gas phase thermochemistry data

Data compiled by: Hussein Y. Afeefy, Joel F. Liebman, and Stephen E. Stein
Quantity | Value | Units | Method | Reference | Comment |
---|---|---|---|---|---|
ΔfH°gas | 21. | kJ/mol | Ccb | Bertholon, Giray, et al., 1971 |

Condensed phase thermochemistry data

Data compiled by: Hussein Y. Afeefy, Joel F. Liebman, and Stephen E. Stein
Quantity | Value | Units | Method | Reference | Comment |
---|---|---|---|---|---|
ΔfH°solid | -88. | kJ/mol | Ccb | Bertholon, Giray, et al., 1971 | |
Quantity | Value | Units | Method | Reference | Comment |
ΔcH°solid | -6063. | kJ/mol | Ccb | Bertholon, Giray, et al., 1971 | Corresponding ΔfHºsolid = -88. kJ/mol (simple calculation by NIST; no Washburn corrections) |

Phase change data

Data compiled as indicated in comments:
ALS - Hussein Y. Afeefy, Joel F. Liebman, and Stephen E. Stein
DRB - Donald R. Burgess, Jr.
Quantity | Value | Units | Method | Reference | Comment |
---|---|---|---|---|---|
ΔsubH° | 109.2 | kJ/mol | C | Bertholon, Giray, et al., 1971 | ALS |
ΔsubH° | 109.0 | kJ/mol | N/A | Bertholon, Giray, et al., 1971 | DRB |

Kovats' RI, non-polar column, isothermal

Column type | Active phase | Temperature (C) | I | Reference | Comment |
---|---|---|---|---|---|
Packed | OV-101 | 197. | 1677. | Dufek, Pacáková, et al., 1981 | N2, Chromaton N Super (0,125-0,16 mm); Column length: 2. m |

Normal alkane RI, non-polar column, temperature ramp

Column type | Active phase | I | Reference | Comment |
---|---|---|---|---|
Capillary | HP-5 | 1704. | Zenkevich, Moeder, et al., 2004 | 30. m/0.25 mm/0.25 μm, Helium, 50. C @ 3. min, 3. K/min, 280. C @ 20. min |

Normal alkane RI, non-polar column, custom temperature program

Column type | Active phase | I | Reference | Comment |
---|---|---|---|---|
Capillary | Polydimethyl siloxane, unknown content of Ph-groups | 1709. | Geldon, 1989 | Program: not specified |

References

Bertholon, Giray, et al., 1971
Bertholon, G.; Giray, M.; Perrin, R.; Vincent-Falquet-Berny, M.F.,
No. 532. - Etude physicochimique des phenols. OX. - Ethanlpies de combustion et energies de resonance des alcoyl et aryphenols,
Bull. Soc. Chim. France, 1971, 3180-3187. [all data]
Golounin and Koptyug, 1973
Golounin, A.V.; Koptyug, V.A.,
Reaction of phenols with Lewis acids. IX. Reactions of resorcinol and phloroglucinol with benzene in the presence of aluminum bromide,
Zh. Org. Khim., 1973, 9, 2377-2380. [all data]
Dufek, Pacáková, et al., 1981
Dufek, P.; Pacáková, V.; Zivný, K.,
Gas chromatographic behaviour of mono- and dihydroxybiphenyls on various silicone phases,
J. Chromatogr., 1981, 211, 1, 150-154, https://doi.org/10.1016/S0021-9673(00)81184-X
. [all data]
Zenkevich, Moeder, et al., 2004
Zenkevich, I.G.; Moeder, M.; Koeller, G.; Schrader, S.,
Using new structurally related additive schemes in the precalculation of gas chromatographic retention indices of polychlorinated hydroxybiphenyls on HP-5 stationary phase,
J. Chromatogr. A, 2004, 1025, 2, 227-236, https://doi.org/10.1016/j.chroma.2003.10.106
. [all data]
Geldon, 1989
Geldon, A.L.,
Ground Water Hydrology of the Central Raton Basin, Colorado and New Mexico, US Geological Survey, US Government Printing Office, 1989, 104. [all data]