2-Quinolinamine
- Formula: C9H8N2
- Molecular weight: 144.1732
- IUPAC Standard InChIKey: GCMNJUJAKQGROZ-UHFFFAOYSA-N
- CAS Registry Number: 580-22-3
- Chemical structure:

Phase change data

Data compiled by: Thermodynamics Research Center, NIST Boulder Laboratories, Chris Muzny director
Quantity | Value | Units | Method | Reference | Comment |
---|---|---|---|---|---|
Tfus | 402.65 | K | N/A | Cumper, Ginman, et al., 1963 | Uncertainty assigned by TRC = 1.5 K |

References

Cumper, Ginman, et al., 1963
Cumper, C.W.N.; Ginman, R.F.A.; Redford, D.G.; Vogel, A.I.,
Physical Properties and Chemical Constitution. Part XXXVIII. The Electric Dipole Moments of Aminopyridines and Aminoquinolines.,
J. Chem. Soc., 1963, 1963, 1731. [all data]