Benzoic acid, 4-bromo-, ethyl ester
- Formula: C9H9BrO2
- Molecular weight: 229.071
- IUPAC Standard InChIKey: XZIAFENWXIQIKR-UHFFFAOYSA-N
- CAS Registry Number: 5798-75-4
- Chemical structure:
View 3d structure (requires JavaScript / HTML 5) - Other names: Benzoic acid, p-bromo-, ethyl ester; p-(Ethoxycarbonyl)phenyl bromide; Ethyl p-bromobenzoate; Ethyl-4-bromobenzoate; 4-Bromobenzoic acid, ethyl ester

Phase change data

Data compiled by: Robert L. Brown and Stephen E. Stein
Reduced pressure boiling point
Tboil (K) | Pressure (bar) | Reference |
---|---|---|
535.2 | 0.983 | Weast and Grasselli, 1989 |
535. | 0.983 | Buckingham and Donaghy, 1982 |
404. | 0.017 | Buckingham and Donaghy, 1982 |

References

Weast and Grasselli, 1989
CRC Handbook of Data on Organic Compounds, 2nd Editon, Weast,R.C and Grasselli, J.G., ed(s)., CRC Press, Inc., Boca Raton, FL, 1989, 1. [all data]
Buckingham and Donaghy, 1982
Buckingham, J.; Donaghy, S.M.,
Dictionary of Organic Compounds: Fifth Edition, Chapman and Hall, New York, 1982, 1. [all data]