bis(dodecylammonium) tetrachlorozincate (II)

Phase change data

Data compiled by: Thermodynamics Research Center, NIST Boulder Laboratories, Chris Muzny director

Quantity Value Units Method Reference Comment
Tfus439.KN/ALandi and Vacatello, 1975Crystal phase 1 phase; Uncertainty assigned by TRC = 1. K
Quantity Value Units Method Reference Comment
Ttriple435.1KN/AZhang and Yang, 1988Crystal phase 1 phase; Uncertainty assigned by TRC = 0.1 K

In addition to the Thermodynamics Research Center (TRC) data available from this site, much more physical and chemical property data is available from the following TRC products:

References

Landi and Vacatello, 1975
Landi, E.; Vacatello, M., Metal-dependent thermal behaviour in (n-CnH2n+1NH3)2MCl4, Thermochim. Acta, 1975, 13, 441. [all data]

Zhang and Yang, 1988
Zhang, Z.-Y.; Yang, M.-L., Thermodynamic properties and phase transitions of dodecylammonium tetrachloromanganate(II) and tetrachlorozincate(II) from 280 to 500 K, Thermochim. Acta, 1988, 123, 15. [all data]