α-Estradiol
- Formula: C18H24O2
- Molecular weight: 272.3820
- IUPAC Standard InChIKey: VOXZDWNPVJITMN-LESVLKBLSA-N
- CAS Registry Number: 57-91-0
- Chemical structure:
- Other names: Estra-1,3,5(10)-triene-3,17-diol, (17α)-; 17α-Estradiol; Epiestradiol; Estra-1,3,5(10)-triene-3,17α-diol; Oestra-1,3,5(10)-triene-3,17α-diol; 1,3,5-Estratriene-3,17α-diol; 17α-Oestradiol; 3,17α-Dihydroxyestra-1,3,5(10)-triene; 3,17α-Dihydroxyoestra-1,3,5(10)-triene; 3,17-Dihydroxyestratriene; Estradiol, 17α-; Oestradiol-17α; Estra-1,3,5(10)-triene-3,17alpha-diol; 17-Epiestradiol; NSC 20293; Epiestrol; Estra-1,3,5(10)-triene-3,17-diol

Kovats' RI, non-polar column, isothermal

Column type | Active phase | Temperature (C) | I | Reference | Comment |
---|---|---|---|---|---|
Capillary | CP Sil 5 CB | 200. | 2725.1 | Novakovic, Tvrzicka, et al., 1995 | Column length: 10. m; Column diameter: 0.25 mm |
Capillary | CP Sil 5 CB | 205. | 2742.9 | Novakovic, Tvrzicka, et al., 1995 | Column length: 10. m; Column diameter: 0.25 mm |
Capillary | CP Sil 5 CB | 210. | 2743.9 | Novakovic, Tvrzicka, et al., 1995 | Column length: 10. m; Column diameter: 0.25 mm |

Van Den Dool and Kratz RI, non-polar column, custom temperature program

Column type | Active phase | I | Reference | Comment |
---|---|---|---|---|
Capillary | VF-5MS | 2707.4 | Tret'yakov, 2008 | 30. m/0.25 mm/0.25 μm, He; Program: Multi-step temperature program; T(initial)=60C; T(final)=270C |

References

Novakovic, Tvrzicka, et al., 1995
Novakovic, J.; Tvrzicka, E.; Vsetecka, V.; Pouzar, V.; Feltl, L.,
Capillary gas-chromatographic retention behavior and physico-chemical properties of underivatized equine estrogens,
Collect. Czech. Chem. Commun., 1995, 60, 5, 813-819, https://doi.org/10.1135/cccc19950813
. [all data]
Tret'yakov, 2008
Tret'yakov, K.V.,
Retention Data. NIST Mass Spectrometry Data Center., NIST Mass Spectrometry Data Center, 2008. [all data]