Tert-butyl-(1,1,3,3-tetra-methylbutyl)diazene
- Formula: C12H26N2
- Molecular weight: 198.3482
- IUPAC Standard InChIKey: OWSDKJHFKVXOPH-BUHFOSPRSA-N
- CAS Registry Number: 57905-89-2
- Chemical structure:

Gas phase thermochemistry data

Data compiled by: Hussein Y. Afeefy, Joel F. Liebman, and Stephen E. Stein
Quantity | Value | Units | Method | Reference | Comment |
---|---|---|---|---|---|
ΔfH°gas | -28.5 ± 1.3 | kcal/mol | Ccb | Engel, Melaugh, et al., 1976 |

Condensed phase thermochemistry data

Data compiled by: Hussein Y. Afeefy, Joel F. Liebman, and Stephen E. Stein
Quantity | Value | Units | Method | Reference | Comment |
---|---|---|---|---|---|
ΔfH°liquid | -41.3 ± 1.3 | kcal/mol | Ccb | Engel, Melaugh, et al., 1976 | |
Quantity | Value | Units | Method | Reference | Comment |
ΔcH°liquid | -1975.4 ± 1.3 | kcal/mol | Ccb | Engel, Melaugh, et al., 1976 |

Phase change data

Data compiled as indicated in comments:
ALS - Hussein Y. Afeefy, Joel F. Liebman, and Stephen E. Stein
DRB - Donald R. Burgess, Jr.
Quantity | Value | Units | Method | Reference | Comment |
---|---|---|---|---|---|
ΔvapH° | 12.81 ± 0.05 | kcal/mol | V | Engel, Melaugh, et al., 1976 | ALS |
ΔvapH° | 12.9 | kcal/mol | N/A | Engel, Melaugh, et al., 1976 | DRB |

References

Engel, Melaugh, et al., 1976
Engel, P.S.; Melaugh, R.A.; Mansson, M.; Timberlake, J.W.; Garner, A.W.; Rossini, F.D.,
Thermochemistry of nine diazenes (azo compounds),
J. Chem. Thermodyn., 1976, 8, 607-621. [all data]