Benzene, 1,1'-(1,2-dimethyl-1,2-ethanediyl)bis-
- Formula: C16H18
- Molecular weight: 210.3141
- IUPAC Standard InChIKey: NGCFVIRRWORSML-UHFFFAOYSA-N
- CAS Registry Number: 5789-35-5
- Chemical structure:
View 3d structure (requires JavaScript / HTML 5) - Stereoisomers:
- Other names: Bibenzyl, α,α'-dimethyl-; Butane, 2,3-diphenyl-; 2,3-Diphenylbutane

Phase change data

Data compiled as indicated in comments:
TRC - Thermodynamics Research Center, NIST Boulder Laboratories, Chris Muzny director
AC - William E. Acree, Jr., James S. Chickos
Quantity | Value | Units | Method | Reference | Comment |
---|---|---|---|---|---|
Tboil | 577.2 | K | N/A | Serijan and Wise, 1952 | Uncertainty assigned by TRC = 2. K; TRC |
Quantity | Value | Units | Method | Reference | Comment |
Tfus | 281. | K | N/A | Brasen and Hauser, 1957 | Uncertainty assigned by TRC = 3. K; TRC |
Tfus | 286. | K | N/A | Greene, 1955 | Uncertainty assigned by TRC = 3. K; TRC |
Enthalpy of sublimation
ΔsubH (kcal/mol) | Temperature (K) | Reference | Comment |
---|---|---|---|
23.1 | 326. | Beckhaus, Ruchardt, et al., 1984 | Based on data from 293. to 348. K.; AC |

References

Serijan and Wise, 1952
Serijan, K.T.; Wise, P.H.,
Dicyclic hydrocarbons. V. Synthesis and physical properties of the diphenyl - and dicyclohexylbutanes,
J. Am. Chem. Soc., 1952, 74, 365-8. [all data]
Brasen and Hauser, 1957
Brasen, W.R.; Hauser, C.R.,
Configurations of Diastereoisomers of 2,3-Diphenylbutyronitrile Obtained in the α-Phenylethylation of Pootassiopheylacetonitrile,
J. Am. Chem. Soc., 1957, 79, 395. [all data]
Greene, 1955
Greene, F.D.,
J. Am. Chem. Soc., 1955, 77, 4869. [all data]
Beckhaus, Ruchardt, et al., 1984
Beckhaus, H.D.; Ruchardt, C.; Smisek, M.,
Anwendung von kraftfeldrechnungen. VI. Verbrennungsenthalpie und bildungsenthalpie von 4-carbomethoxy-homocuban und homocuban-4-carbonsaure-ein testfall zur berechnung von bildungsenthalpien nach dem kraftfeldverfahren,
Thermochim. Acta, 1984, 79, 149-159. [all data]