Ergosterol
- Formula: C28H44O
- Molecular weight: 396.6484
- IUPAC Standard InChIKey: DNVPQKQSNYMLRS-CVGROQQCSA-N
- CAS Registry Number: 57-87-4
- Chemical structure:
- Other names: Ergosta-5,7,22-trien-3-ol, (3β,22E)-; Ergosterin; Provitamin D; Provitamin D2; (3β)-Ergosta-5,7,22- trien-3-ol; (3β,22E)-Ergosta-5,7,22-trien-3-ol; Ergosterol, # 2; Ergosta-5,7,22-trien-3β-ol; Ergosterol, # 1

Condensed phase thermochemistry data

Data compiled by: Hussein Y. Afeefy, Joel F. Liebman, and Stephen E. Stein
Quantity | Value | Units | Method | Reference | Comment |
---|---|---|---|---|---|
ΔfH°solid | -788.2 ± 2.1 | kJ/mol | Ccb | Bills, McDonald, et al., 1931 | |
Quantity | Value | Units | Method | Reference | Comment |
ΔcH°solid | -16518.4 | kJ/mol | Ccb | Bills, McDonald, et al., 1931 | Corresponding ΔfHºsolid = -788.14 kJ/mol (simple calculation by NIST; no Washburn corrections) |

Phase change data

Data compiled as indicated in comments:
AC - William E. Acree, Jr., James S. Chickos
ALS - Hussein Y. Afeefy, Joel F. Liebman, and Stephen E. Stein
Quantity | Value | Units | Method | Reference | Comment |
---|---|---|---|---|---|
ΔsubH° | 118.8 | kJ/mol | V | Hickman, Hecker, et al., 1937 | ALS |
Enthalpy of vaporization
ΔvapH (kJ/mol) | Temperature (K) | Method | Reference | Comment |
---|---|---|---|---|
118.7 | 436. | A | Stephenson and Malanowski, 1987 | Based on data from 421. to 454. K.; AC |
Enthalpy of sublimation
ΔsubH (kJ/mol) | Temperature (K) | Method | Reference | Comment |
---|---|---|---|---|
147.0 ± 0.9 | 318. to 412. | ME | Oja, Chen, et al., 2009 | AC |

Kovats' RI, non-polar column, isothermal

Column type | Active phase | Temperature (C) | I | Reference | Comment |
---|---|---|---|---|---|
Packed | SE-30 | 230. | 3087. | Keiser, Yazlovetsky, et al., 1986 | N2; Column length: 1.2 m |
Packed | SE-30 | 240. | 3123. | Keiser, Yazlovetsky, et al., 1986 | N2; Column length: 1.2 m |
Packed | SE-30 | 250. | 3144. | Keiser, Yazlovetsky, et al., 1986 | N2; Column length: 1.2 m |
Packed | SE-30 | 240. | 3080. | Keiser, Yazlovetsky, et al., 1986 | N2; Column length: 1.2 m |

Normal alkane RI, non-polar column, temperature ramp

Column type | Active phase | I | Reference | Comment |
---|---|---|---|---|
Capillary | HP-5 MS | 3080. | Xu, Han, et al., 2012 | 30. m/0.25 mm/0.25 μm, 60. C @ 2. min, 15. K/min, 300. C @ 10. min |
Capillary | HP-5 MS | 3080. | Xu, Han, et al., 2009 | 30. m/0.25 mm/0.25 μm, Helium, 60. C @ 2. min, 15. K/min, 300. C @ 10. min |

Normal alkane RI, non-polar column, custom temperature program

Column type | Active phase | I | Reference | Comment |
---|---|---|---|---|
Capillary | DB-5 MS | 3152. | Radulovic and Dordevic, 2011 | 30. m/0.25 mm/0.25 μm, Helium; Program: not specified |

References

Bills, McDonald, et al., 1931
Bills, C.E.; McDonald, F.G.; Be-Miller, L.N.; Steel, G.E.; Nussmeier, M.,
Heat of combustion of activated ergosterol,
J. Biol. Chem., 1931, 93, 775-785. [all data]
Hickman, Hecker, et al., 1937
Hickman, K.C.D.; Hecker, J.C.; Embree, N.D.,
Direct determination of low vapor pressures,
Ind. Eng. Chem., 1937, 9, 264-267. [all data]
Stephenson and Malanowski, 1987
Stephenson, Richard M.; Malanowski, Stanislaw,
Handbook of the Thermodynamics of Organic Compounds, 1987, https://doi.org/10.1007/978-94-009-3173-2
. [all data]
Oja, Chen, et al., 2009
Oja, Vahur; Chen, Xu; Hajaligol, Mohammad R.; Chan, W. Geoffrey,
Sublimation Thermodynamic Parameters for Cholesterol, Ergosterol, β-Sitosterol, and Stigmasterol,
J. Chem. Eng. Data, 2009, 54, 3, 730-734, https://doi.org/10.1021/je800395m
. [all data]
Keiser, Yazlovetsky, et al., 1986
Keiser, L.S.; Yazlovetsky, I.G.; Retunsky, V.N.,
Gas-chromatographic indentification of sterols in insects with the use of two-dimentional three-phase diagrams plotted on the basis of logarithmic retention indices,
J. Anal. Chem. USSR (Engl. Transl.), 1986, 41, 9, 1166-1172. [all data]
Xu, Han, et al., 2012
Xu, L.-L.; Han, T.; Wu, J.-Z.; Zhang, Q.-Y.; Zhang, H.; Huang, B.-K.; Rahman, K.,
Comparative research of chemical constituents, antifungal and antitumor properties of ether extracts of Panax ginseng and its endophytic fungus, 2012, retrieved from http://www.thefreelibrary.com/Comparative .... [all data]
Xu, Han, et al., 2009
Xu, L.-L.; Han, T.; Wu, J.-Z.; Zhang, Q.-Y.; Zhang, H.; Huang, B.-K.; Rahman, K.,
Comparative research of chemical constituents, antifungal and antitumor properties of ether extracts of Panax ginseng and its endophytic fungus,
Phytomedicine: Int. J. Phytotherapy Phytopharmacology, 2009, 16, 6-7, 609-616, https://doi.org/10.1016/j.phymed.2009.03.014
. [all data]
Radulovic and Dordevic, 2011
Radulovic, N.S.; Dordevic, N.D.,
Sterods from poison hemlock (Conium maculatum L.): a GC-MS analysis,
J. Serb. Chem. Soc., 2011, 76, 11, 1471-1483, https://doi.org/10.2298/JSC110206128R
. [all data]