8-Quinolinamine
- Formula: C9H8N2
- Molecular weight: 144.1732
- IUPAC Standard InChIKey: WREVVZMUNPAPOV-UHFFFAOYSA-N
- CAS Registry Number: 578-66-5
- Chemical structure:
View 3d structure (requires JavaScript / HTML 5) - Other names: Quinoline, 8-amino-; 8-Aminoquinoline; 8-Quinolylamine

Gas phase thermochemistry data

Data compiled by: Hussein Y. Afeefy, Joel F. Liebman, and Stephen E. Stein
Quantity | Value | Units | Method | Reference | Comment |
---|---|---|---|---|---|
ΔfH°gas | 187.6 ± 2.2 | kJ/mol | Ccb | Ribeiro da Silva, Matos, et al., 1993 |

Condensed phase thermochemistry data

Data compiled by: Hussein Y. Afeefy, Joel F. Liebman, and Stephen E. Stein
Quantity | Value | Units | Method | Reference | Comment |
---|---|---|---|---|---|
ΔfH°solid | 94.3 ± 2.1 | kJ/mol | Ccb | Ribeiro da Silva, Matos, et al., 1993 | |
Quantity | Value | Units | Method | Reference | Comment |
ΔcH°solid | -4779.2 ± 1.6 | kJ/mol | Ccb | Ribeiro da Silva, Matos, et al., 1993 |

Phase change data

Data compiled as indicated in comments:
BS - Robert L. Brown and Stephen E. Stein
TRC - Thermodynamics Research Center, NIST Boulder Laboratories, Chris Muzny director
ALS - Hussein Y. Afeefy, Joel F. Liebman, and Stephen E. Stein
DRB - Donald R. Burgess, Jr.
AC - William E. Acree, Jr., James S. Chickos
Quantity | Value | Units | Method | Reference | Comment |
---|---|---|---|---|---|
Tfus | 343. | K | N/A | Buckingham and Donaghy, 1982 | BS |
Tfus | 337.65 | K | N/A | Cumper, Ginman, et al., 1963 | Uncertainty assigned by TRC = 1.5 K; TRC |
Quantity | Value | Units | Method | Reference | Comment |
ΔsubH° | 93.33 ± 0.50 | kJ/mol | C | Ribeiro da Silva, Matos, et al., 1993 | ALS |
ΔsubH° | 93.3 | kJ/mol | N/A | Ribeiro da Silva, Matos, et al., 1993 | DRB |
ΔsubH° | 93.3 ± 0.5 | kJ/mol | ME | da Silva, Matos, et al., 1993 | Based on data from 296. to 314. K.; AC |
Reduced pressure boiling point
Tboil (K) | Pressure (bar) | Reference | Comment |
---|---|---|---|
447.2 | 0.035 | Aldrich Chemical Company Inc., 1990 | BS |
430. to 435. | 0.027 | Buckingham and Donaghy, 1982 | BS |
Enthalpy of sublimation
ΔsubH (kJ/mol) | Temperature (K) | Method | Reference | Comment |
---|---|---|---|---|
93.0 ± 0.5 | 305. | ME | da Silva, Matos, et al., 1993 | Based on data from 296. to 314. K.; AC |

References

Ribeiro da Silva, Matos, et al., 1993
Ribeiro da Silva, M.A.V.; Matos, M.A.R.; Monte, M.J.S.; Alves, M.C.B.; Vieira, J.M.A.P.,
Enthalpies of combustion, vapour pressures, and enthalpies of sublimation of 3-,5-,6-, and 8-aminoquinoline,
J. Chem. Thermodyn., 1993, 25, 579-590. [all data]
Buckingham and Donaghy, 1982
Buckingham, J.; Donaghy, S.M.,
Dictionary of Organic Compounds: Fifth Edition, Chapman and Hall, New York, 1982, 1. [all data]
Cumper, Ginman, et al., 1963
Cumper, C.W.N.; Ginman, R.F.A.; Redford, D.G.; Vogel, A.I.,
Physical Properties and Chemical Constitution. Part XXXVIII. The Electric Dipole Moments of Aminopyridines and Aminoquinolines.,
J. Chem. Soc., 1963, 1963, 1731. [all data]
da Silva, Matos, et al., 1993
da Silva, Manuel A.V. Ribeiro; Matos, M. Agostinha R.; Monte, Manuel J.S.; Alves, M. Céu B.; Vieira, João M.A.P.,
Enthalpies of combustion, vapour pressures, and enthalpies of sublimation of 3-, 5-, 6-, and 8-aminoquinoline,
The Journal of Chemical Thermodynamics, 1993, 25, 5, 579-590, https://doi.org/10.1006/jcht.1993.1052
. [all data]
Aldrich Chemical Company Inc., 1990
Aldrich Chemical Company Inc.,
Catalog Handbook of Fine Chemicals, Aldrich Chemical Company, Inc., Milwaukee WI, 1990, 1. [all data]
Steck and Ewing, 1948
Steck, E.A.; Ewing, G.W.,
Absorption spectra of heterocyclic compounds. II. Amino-derivatives of pyridine, quinoline and isoquinoline,
J. Am. Chem. Soc., 1948, 70, 3397-3406. [all data]