Ethanone, 1-(2-nitrophenyl)-
- Formula: C8H7NO3
- Molecular weight: 165.1461
- IUPAC Standard InChIKey: SUGXZLKUDLDTKX-UHFFFAOYSA-N
- CAS Registry Number: 577-59-3
- Chemical structure:
View 3d structure (requires JavaScript / HTML 5) - Other names: Acetophenone, 2'-nitro-; o-Nitroacetophenone; 2'-Nitroacetophenone; 2-Nitroacetophenone; 1-(2-Nitrophenyl)ethanone; Methyl 2-nitrophenyl ketone

Phase change data

Data compiled as indicated in comments:
BS - Robert L. Brown and Stephen E. Stein
AC - William E. Acree, Jr., James S. Chickos
Reduced pressure boiling point
Tboil (K) | Pressure (bar) | Reference | Comment |
---|---|---|---|
432.2 | 0.021 | Aldrich Chemical Company Inc., 1990 | BS |
Enthalpy of vaporization
ΔvapH (kJ/mol) | Temperature (K) | Method | Reference | Comment |
---|---|---|---|---|
103.6 | 308. | A | Stephenson and Malanowski, 1987 | Based on data from 293. to 333. K.; AC |

Gas phase ion energetics data

Data compiled by: John E. Bartmess
Electron affinity determinations
EA (eV) | Method | Reference | Comment |
---|---|---|---|
1.40 ± 0.10 | IMRE | Chowdhury, Kishi, et al., 1989 | ΔGea(423 K) = -30.9 kcal/mol, ΔS = -3 eu est |

Kovats' RI, non-polar column, isothermal

Column type | Active phase | Temperature (C) | I | Reference | Comment |
---|---|---|---|---|---|
Packed | OV-101 | 160. | 1361.3 | Hassani and Meklati, 1992 | N2, Chromosorb G HP; Column length: 5. m |
Packed | OV-3 | 160. | 1456.5 | Hassani and Meklati, 1992 | N2, Chromosorb G HP; Column length: 5. m |

References

Aldrich Chemical Company Inc., 1990
Aldrich Chemical Company Inc.,
Catalog Handbook of Fine Chemicals, Aldrich Chemical Company, Inc., Milwaukee WI, 1990, 1. [all data]
Stephenson and Malanowski, 1987
Stephenson, Richard M.; Malanowski, Stanislaw,
Handbook of the Thermodynamics of Organic Compounds, 1987, https://doi.org/10.1007/978-94-009-3173-2
. [all data]
Chowdhury, Kishi, et al., 1989
Chowdhury, S.; Kishi, H.; Dillow, G.W.; Kebarle, P.,
Electron Affinities of Substituted Nitrobenzenes,
Can. J. Chem., 1989, 67, 4, 603, https://doi.org/10.1139/v89-091
. [all data]
Grammaticakis, 1953
Grammaticakis, P.,
Contribution a l'etude de l'absorption dans l'U.-V. moyen et le visible des composes carbonyles aromatiques et de leurs derives. (2e memoire),
Bull. Soc. Chim. Fr., 1953, 20, 865-872. [all data]
Hassani and Meklati, 1992
Hassani, A.; Meklati, B.Y.,
Gas chromatographic behaviour of monosubstituted benzenes, benzaldehydes and acetophenones on OV polymethylphenyl-silicone stationary phases,
Chromatographia, 1992, 33, 5/6, 267-271, https://doi.org/10.1007/BF02276193
. [all data]