2-Acetylbenzoic acid
- Formula: C9H8O3
- Molecular weight: 164.1580
- IUPAC Standard InChIKey: QDAWXRKTSATEOP-UHFFFAOYSA-N
- CAS Registry Number: 577-56-0
- Chemical structure:
View 3d structure (requires JavaScript / HTML 5) - Other names: Acetophenone-2-carboxylic acid; Benzoic acid, 2-acetyl-

Van Den Dool and Kratz RI, polar column, temperature ramp

Column type | Active phase | I | Reference | Comment |
---|---|---|---|---|
Capillary | Carbowax 20M | 2489. | Verzera, Campisi, et al., 2005 | 60. m/0.25 mm/0.25 μm, He, 45. C @ 0.17 min, 2. K/min; Tend: 250. C |
Capillary | CP-Wax 52CB | 2489. | Verzera, Campisi, et al., 2001 | 60. m/0.25 mm/0.25 μm, He, 45. C @ 0.17 min, 2. K/min; Tend: 250. C |

Normal alkane RI, polar column, custom temperature program

Column type | Active phase | I | Reference | Comment |
---|---|---|---|---|
Capillary | Carbowax 20M | 2489. | Editorial paper, 2005 | Program: not specified |

References

Verzera, Campisi, et al., 2005
Verzera, A.; Campisi, S.; Zappalá, M.,
SUPELCO. Using SPME-GC-MS to characterize volatile components of honey as indicators of botanical origin, 2005, retrieved from http://www.sigmaaldrich.com/Brands/SupelcoHome/TheReporter.html. [all data]
Verzera, Campisi, et al., 2001
Verzera, A.; Campisi, S.; Zappalá, M.; Bonaccorsi, I.,
SPME-GC-MS analysis of honey volatile components for the characterization of different floral origin,
Am. Lab. Fairfield Conn., 2001, 33, 15, 18-21. [all data]
Editorial paper, 2005
Editorial paper,
Solid Phase Microextraction (SPME) Application Guide,
The Reporter Europe (Supelco), 2005, 16, 5, 12-12. [all data]