5α-Androstan-3β-ol-17-one, TBDMS derivative
- Formula: C25H44O2Si
- Molecular weight: 404.7012
- IUPAC Standard InChIKey: UGWVQACEZWDYMD-XWJDHQGKSA-N
- CAS Registry Number: 57711-44-1
- Chemical structure:
- Other names: Androstan-17-one, 3-[[(1,1-dimethylethyl)dimethylsilyl]oxy]-, (3β,5α)-; 3-β-tert-Butyldimethylsilyloxy-5-α-androstan-17-one; 3-([tert-Butyl(dimethyl)silyl]oxy)androstan-17-one-, (3β,5α)-; Epiandrosterone, TBDMSi (3-O)

Kovats' RI, non-polar column, isothermal

Column type | Active phase | Temperature (C) | I | Reference | Comment |
---|---|---|---|---|---|
Packed | OV-1 | 230. | 2816. | Quilliam and Westmore, 1978 | Gas Chrom Q; Column length: 1. m |
Packed | OV-1 | 260. | 2870. | Quilliam and Westmore, 1978 | Gas Chrom Q; Column length: 1. m |

References

Quilliam and Westmore, 1978
Quilliam, M.A.; Westmore, J.B.,
Sterically crowded trialkylsilyl derivatives for chromatography and mass spectrometry of biologically-important compounds,
Anal. Chem., 1978, 50, 1, 59-68, https://doi.org/10.1021/ac50023a020
. [all data]