3-Octanol, 3,7-dimethyl-

Phase change data

Data compiled as indicated in comments:
TRC - Thermodynamics Research Center, NIST Boulder Laboratories, Chris Muzny director
BS - Robert L. Brown and Stephen E. Stein

Quantity Value Units Method Reference Comment
Tboil469.4KN/AWallach, 1915Uncertainty assigned by TRC = 4. K; TRC

Reduced pressure boiling point

Tboil (K) Pressure (bar) Reference Comment
345.20.008Aldrich Chemical Company Inc., 1990BS

In addition to the Thermodynamics Research Center (TRC) data available from this site, much more physical and chemical property data is available from the following TRC products:

References

Wallach, 1915
Wallach, O., Justus Liebigs Ann. Chem., 1915, 408, 183. [all data]

Aldrich Chemical Company Inc., 1990
Aldrich Chemical Company Inc., Catalog Handbook of Fine Chemicals, Aldrich Chemical Company, Inc., Milwaukee WI, 1990, 1. [all data]